BDBM415463 US10428104, Example 10
SMILES Cc1cc(ccc1F)[C@@H](O)[C@H]1O[C@H]([C@H](O)[C@@H]1O)n1ccc2c(C)ncnc12
InChI Key InChIKey=VSMRUEXRQOTXLT-FSNPWBFUSA-N
Data  1 IC50
  Tab Delimited (TSV)   2D SDfile   Computed 3D by Vconf -m prep SDfile
Find this compound or compounds like it in BindingDB:
Activity Spreadsheet -- Enzyme Inhibition Constant Data from BindingDB
Found 1 hit for monomerid = 415463
TargetProtein arginine N-methyltransferase 5(Homo sapiens (Human))
Pfizer
US Patent
LigandPNGBDBM415463(US10428104, Example 10)
Affinity DataIC50:  7nM. Assay description: Compounds were solubilized in DMSO and serially diluted, using 3-fold dilutions, into 100% DMSO at a concentration 50-fold greater than the desired a...
Ligand InfoPC cidPC sid
In DepthDetails US Patent