BDBM415502 US10428087, Example 43 second peak::US10829502, Example 43-2::US11401280, Example 43-2
SMILES C[C@H](Nc1ncnc2[nH]cnc12)c1nc2scc(C)n2c(=O)c1-c1ccccc1Cl
InChI Key
Data  3 IC50
  Tab Delimited (TSV)   2D SDfile   Computed 3D by Vconf -m prep SDfile
Find this compound or compounds like it in BindingDB:
Activity Spreadsheet -- Enzyme Inhibition Constant Data from BindingDB
Found 3 hits for monomerid = 415502
LigandPNGBDBM415502(US10428087, Example 43 second peak | US10829502, E...)
Affinity DataIC50: <50nM. Assay description: Assay A2: The kinase reaction was conducted in clear-bottom 96-well plate from Thermo Fisher Scientific in a final volume of 24 μL. Inhibitors w...
Ligand InfoKEGGPC cidPC sid
In DepthDetails US Patent
LigandPNGBDBM415502(US10428087, Example 43 second peak | US10829502, E...)
Affinity DataIC50: <50nM. Assay description: PI3Kα, PI3Kβ, PI3Kγ: The kinase reaction was conducted in clear-bottom 96-well plate from Thermo Fisher Scientific in a final volume o...
Ligand InfoKEGGPC cidPC sid
In DepthDetails US Patent
LigandPNGBDBM415502(US10428087, Example 43 second peak | US10829502, E...)
Affinity DataIC50: <50nM. Assay description: Example A3: The kinase reaction was conducted in polystyrene 384-well matrix white plate from Thermo Fisher Scientific in a final volume of 25 μ...
Ligand InfoKEGGPC cidPC sid
In DepthDetails US Patent