BDBM415547 (Scheme GG) (2S,3S,4R,5R)-2-(3-(ethoxymethyl)-1H-pyrazol-5-yl)-5-(4-methyl-7H-pyrrolo[2,3-d]pyrimidin-7-yl)tetrahydrofuran-3,4-diol (FF-6)::US10428104, Example 78
SMILES CCOCc1cc([nH]n1)[C@@H]1O[C@H]([C@H](O)[C@@H]1O)n1ccc2c(C)ncnc12
InChI Key InChIKey=LDFTYJFRMUWXNG-QSJFSLAZSA-N
Data  1 IC50
  Tab Delimited (TSV)   2D SDfile   Computed 3D by Vconf -m prep SDfile
Find this compound or compounds like it in BindingDB:
Activity Spreadsheet -- Enzyme Inhibition Constant Data from BindingDB
Found 1 hit for monomerid = 415547
TargetProtein arginine N-methyltransferase 5(Homo sapiens (Human))
Pfizer
US Patent
LigandPNGBDBM415547((Scheme GG) (2S,3S,4R,5R)-2-(3-(ethoxymethyl)-1H-p...)
Affinity DataIC50:  5.11E+4nM. Assay description: Compounds were solubilized in DMSO and serially diluted, using 3-fold dilutions, into 100% DMSO at a concentration 50-fold greater than the desired a...
Ligand InfoPC cidPC sid
In DepthDetails US Patent