BDBM415564 US10428104, Example 95
SMILES Cc1ncnc2n(ccc12)[C@@H]1O[C@H]([C@@H](N)c2ccc(F)c(F)c2)[C@@H](O)[C@H]1O
InChI Key InChIKey=CATWWGFETIUKQV-ZNFSNMQZSA-N
Data  1 IC50
  Tab Delimited (TSV)   2D SDfile   Computed 3D by Vconf -m prep SDfile
Find this compound or compounds like it in BindingDB:
Activity Spreadsheet -- Enzyme Inhibition Constant Data from BindingDB
Found 1 hit for monomerid = 415564
TargetProtein arginine N-methyltransferase 5(Homo sapiens (Human))
Pfizer
US Patent
LigandPNGBDBM415564(US10428104, Example 95)
Affinity DataIC50:  150nM. Assay description: Compounds were solubilized in DMSO and serially diluted, using 3-fold dilutions, into 100% DMSO at a concentration 50-fold greater than the desired a...
Ligand InfoPC cidPC sid
In DepthDetails US Patent