BDBM415681 US10428108, Example 90
SMILES CC(C)[C@H](NC(=O)[C@@H](NC(=O)C[C@@H](Oc1cccc(Cl)c1)c1ccccc1)c1ccccc1)C(=O)C(F)(F)C(=O)NCC(F)(F)F
InChI Key InChIKey=RUHOSYNFPHAVII-STXQHDJLSA-N
Data  1 IC50
  Tab Delimited (TSV)   2D SDfile   Computed 3D by Vconf -m prep SDfile
Find this compound or compounds like it in BindingDB:
Activity Spreadsheet -- Enzyme Inhibition Constant Data from BindingDB
Found 1 hit for monomerid = 415681
TargetSerine protease HTRA1(Homo sapiens (Human))
Hoffmann-La Roche
US Patent
LigandPNGBDBM415681(US10428108, Example 90)
Affinity DataIC50:  50nM. Assay description: Enzyme activity is measured by observing the increase in fluorescence intensity caused by cleavage of a peptide substrate containing a fluorophore, w...
Ligand InfoPC cidPC sid
In DepthDetails US Patent