BDBM415990 4-(6-{[trans-4-(1- methylethoxy)cyclohexyl]- carbonyl}-6,11- dihydro-5H-pyrido[2,3- b][1,5]benzodiazepin-8- yl)tetrahydro-2H-pyran- 4-carbonitrile::US10442819, Example 138
SMILES CC(C)O[C@H]1CC[C@@H](CC1)C(=O)N1Cc2cccnc2Nc2ccc(cc12)C1(CCOCC1)C#N
InChI Key InChIKey=HJWWMIAGFDXYBL-JKIUYZKVSA-N
Data  1 IC50
  Tab Delimited (TSV)   2D SDfile   Computed 3D by Vconf -m prep SDfile
Find this compound or compounds like it in BindingDB:
Activity Spreadsheet -- Enzyme Inhibition Constant Data from BindingDB
Found 1 hit for monomerid = 415990
TargetIsocitrate dehydrogenase [NADP] cytoplasmic [R132H](Homo sapiens (Human))
Merck Sharp & Dohme
US Patent
LigandPNGBDBM415990(4-(6-{[trans-4-(1- methylethoxy)cyclohexyl]- carbo...)
Affinity DataIC50:  4nM. Assay description: Each test compound (10 mM stock in DMSO) is diluted in DMSO to make a 10-point, 3-fold dilution series. 125 nL of each dilution or DMSO alone is disp...
Ligand InfoPC cidPC sid
In DepthDetails US Patent