BDBM41605 3-(1-Methyl-1H-benzoimidazol-2-yl)-1-(3-phenyl-propyl)-1H-pyrrolo[2,3-b]quinoxalin-2-ylamine::3-(1-methyl-2-benzimidazolyl)-1-(3-phenylpropyl)-2-pyrrolo[3,2-b]quinoxalinamine::3-(1-methylbenzimidazol-2-yl)-1-(3-phenylpropyl)pyrrolo[3,2-b]quinoxalin-2-amine::MLS000559002::SMR000149318::[3-(1-methylbenzimidazol-2-yl)-1-(3-phenylpropyl)pyrrolo[3,2-b]quinoxalin-2-yl]amine::cid_4971561
SMILES Cn1c(nc2ccccc12)-c1c(N)n(CCCc2ccccc2)c2nc3ccccc3nc12
InChI Key InChIKey=BQQWMXUYUQDOGR-UHFFFAOYSA-N
Data  2 IC50
  Tab Delimited (TSV)   2D SDfile   Computed 3D by Vconf -m prep SDfile
Find this compound or compounds like it in BindingDB:
Activity Spreadsheet -- Enzyme Inhibition Constant Data from BindingDB
Found 2 hits for monomerid = 41605
TargetSphingosine 1-phosphate receptor 2(Homo sapiens (Human))
The Scripps Research Institute Molecular Screening Center
Curated by PubChem BioAssay
LigandPNGBDBM41605(3-(1-Methyl-1H-benzoimidazol-2-yl)-1-(3-phenyl-pro...)
Affinity DataIC50: >5.00E+4nM. Assay description: Source (MLSCN Center Name): The Scripps Research Institute Molecular Screening Center Center Affiliation: The Scripps Research Institute (TSRI) Assay...
In DepthDetails PCBioAssay
TargetSphingosine 1-phosphate receptor 2(Homo sapiens (Human))
The Scripps Research Institute Molecular Screening Center
Curated by PubChem BioAssay
LigandPNGBDBM41605(3-(1-Methyl-1H-benzoimidazol-2-yl)-1-(3-phenyl-pro...)
Affinity DataIC50:  8.00E+3nM. Assay description: Source (MLSCN Center Name): The Scripps Research Institute Molecular Screening Center Center Affiliation: The Scripps Research Institute (TSRI) Assay...
In DepthDetails PCBioAssay