BDBM416437 (R)-1-cyclopropyl-N-(1-(5-(ethylsulfonyl)pyridin-2-yl)-2-hydroxyethyl)-2-(4-(trifluoromethyl)benzyl)-1H-indole-5-carboxamide::US10301261, Compound IN-19::US10829448, Compound IN-19
SMILES CCS(=O)(=O)c1ccc(nc1)[C@H](CO)NC(=O)c1ccc2n(C3CC3)c(Cc3ccc(cc3)C(F)(F)F)cc2c1
InChI Key InChIKey=SNASKOFSVZIRJB-SANMLTNESA-N
Data  2 KI  1 IC50
  Tab Delimited (TSV)   2D SDfile   Computed 3D by Vconf -m prep SDfile
Find this compound or compounds like it in BindingDB:
Activity Spreadsheet -- Enzyme Inhibition Constant Data from BindingDB
Found 3 hits for monomerid = 416437
TargetNuclear receptor ROR-gamma(Homo sapiens (Human))
Vitae Pharmaceuticals
US Patent
LigandPNGBDBM416437((R)-1-cyclopropyl-N-(1-(5-(ethylsulfonyl)pyridin-2...)
Affinity DataKi: <100nM. Assay description: Compounds described herein were tested for ability to bind to RORγ in a cell-free competition assay with commercially available radio-ligand (RL...
Ligand InfoPC cidPC sid
In DepthDetails US Patent
TargetNuclear receptor ROR-gamma(Homo sapiens (Human))
Vitae Pharmaceuticals
US Patent
LigandPNGBDBM416437((R)-1-cyclopropyl-N-(1-(5-(ethylsulfonyl)pyridin-2...)
Affinity DataKi: <100nM. Assay description: Compounds described herein were tested for ability to bind to RORγ in a cell-free competition assay with commercially available radio-ligand (RL...
Ligand InfoPC cidPC sid
In DepthDetails US Patent
TargetNuclear receptor ROR-gamma(Homo sapiens (Human))
Vitae Pharmaceuticals
US Patent
LigandPNGBDBM416437((R)-1-cyclopropyl-N-(1-(5-(ethylsulfonyl)pyridin-2...)
Affinity DataIC50: <100nM. Assay description: Compounds described herein were tested for RORγ inverse agonist activity in a cell-based, transcriptional activity assay. Secreted NanolucŪ luci...
Ligand InfoPC cidPC sid
In DepthDetails US Patent