BDBM416592 1-((4-amino-3-(6-cyclopropoxynaphthalen-2-yl)-1H-pyrazolo[3,4-d]pyrimidin-1-yl)methyl)cyclobutanol::US10307425, Example 59::US10632122, Example 59
SMILES Nc1ncnc2n(CC3(O)CCC3)nc(-c3ccc4cc(OC5CC5)ccc4c3)c12
InChI Key InChIKey=ZEBRCVUOMBVYAB-UHFFFAOYSA-N
Data  2 IC50
  Tab Delimited (TSV)   2D SDfile   Computed 3D by Vconf -m prep SDfile
Find this compound or compounds like it in BindingDB:
Activity Spreadsheet -- Enzyme Inhibition Constant Data from BindingDB
Found 2 hits for monomerid = 416592
TargetCalmodulin-domain protein kinase 1(Toxoplasma gondii)
University Of Washington
US Patent
LigandPNGBDBM416592(1-((4-amino-3-(6-cyclopropoxynaphthalen-2-yl)-1H-p...)
Affinity DataIC50:  8.60nM. Assay description: Inhibitors were evaluated in triplicate in eight-point dilutions (3-fold dilutions) during the enzymatic reactions. TgCDPK1 enzymatic inhibition was ...
Ligand InfoPC cidPC sid
In DepthDetails US Patent
TargetCAM kinase, CDPK family TgCDPK1(Toxoplasma gondii (strain ATCC 50861 / VEG))
University Of Washington
US Patent
LigandPNGBDBM416592(1-((4-amino-3-(6-cyclopropoxynaphthalen-2-yl)-1H-p...)
Affinity DataIC50:  8.60nM. Assay description: Inhibitors were evaluated in triplicate in eight-point dilutions (3-fold dilutions) during the enzymatic reactions. TgCDPK1 enzymatic inhibition was ...
Ligand InfoPC cidPC sid
In DepthDetails US Patent