BDBM416646 1-(6-ethoxynaphthalen-2-yl)-3-((1-methylpiperidin-4-yl)methyl)imidazo[1,5-a]pyrazin-8-amine::US10307425, Example 115::US10632122, Example 115
SMILES CCOc1ccc2cc(ccc2c1)-c1nc(CC2CCN(C)CC2)n2ccnc(N)c12
InChI Key InChIKey=JRLNZLOGPPLOOP-UHFFFAOYSA-N
Data  2 IC50
  Tab Delimited (TSV)   2D SDfile   Computed 3D by Vconf -m prep SDfile
Find this compound or compounds like it in BindingDB:
Activity Spreadsheet -- Enzyme Inhibition Constant Data from BindingDB
Found 2 hits for monomerid = 416646
TargetCalmodulin-domain protein kinase 1(Toxoplasma gondii)
University Of Washington
US Patent
LigandPNGBDBM416646(1-(6-ethoxynaphthalen-2-yl)-3-((1-methylpiperidin-...)
Affinity DataIC50:  18.6nM. Assay description: Inhibitors were evaluated in triplicate in eight-point dilutions (3-fold dilutions) during the enzymatic reactions. TgCDPK1 enzymatic inhibition was ...
Ligand InfoPC cidPC sid
In DepthDetails US Patent
TargetCAM kinase, CDPK family TgCDPK1(Toxoplasma gondii (strain ATCC 50861 / VEG))
University Of Washington
US Patent
LigandPNGBDBM416646(1-(6-ethoxynaphthalen-2-yl)-3-((1-methylpiperidin-...)
Affinity DataIC50:  18.6nM. Assay description: Inhibitors were evaluated in triplicate in eight-point dilutions (3-fold dilutions) during the enzymatic reactions. TgCDPK1 enzymatic inhibition was ...
Ligand InfoPC cidPC sid
In DepthDetails US Patent