BDBM416730 1-(3-(aminomethyl)phenyl)-N-(3-(3-cyclopropyl-1-phenylpropyl)phenyl)-3-(trifluoromethyl)-1H-pyrazole-5-carboxamide::US10329260, Compound 78d::US10633345, Compound 78d::US10689346, Compound 78d::US11203574, Compound 78d::US11230530, Compound 78d::US11685721, Compound 78d::US11708332, Compound 78d
SMILES NCc1cccc(c1)-n1nc(cc1C(=O)Nc1cccc(c1)C(CCC1CC1)c1ccccc1)C(F)(F)F
InChI Key InChIKey=LVGPKQXQIQRVCT-UHFFFAOYSA-N
Data  8 KI  2 IC50
  Tab Delimited (TSV)   2D SDfile   Computed 3D by Vconf -m prep SDfile
Find this compound or compounds like it in BindingDB:
Activity Spreadsheet -- Enzyme Inhibition Constant Data from BindingDB
Found 10 hits for monomerid = 416730
TargetPlasma kallikrein(Homo sapiens (Human))
Biocryst Pharmaceuticals
US Patent
LigandPNGBDBM416730(1-(3-(aminomethyl)phenyl)-N-(3-(3-cyclopropyl-1-ph...)
Affinity DataKi:  25.1nM. Assay description: The effect of compounds of the invention on human plasma kallikrein activity was determined using the chromogenic substrates (DiaPharma Group, Inc., ...
Ligand InfoPC cidPC sid
In DepthDetails US Patent
TargetPlasma kallikrein(Homo sapiens (Human))
Biocryst Pharmaceuticals
US Patent
LigandPNGBDBM416730(1-(3-(aminomethyl)phenyl)-N-(3-(3-cyclopropyl-1-ph...)
Affinity DataKi:  25.1nM. Assay description: The effect of compounds of the invention on human plasma kallikrein activity was determined using the chromogenic substrates (DiaPharma Group, Inc., ...
Ligand InfoPC cidPC sid
In DepthDetails US Patent
TargetPlasma kallikrein(Homo sapiens (Human))
Biocryst Pharmaceuticals
US Patent
LigandPNGBDBM416730(1-(3-(aminomethyl)phenyl)-N-(3-(3-cyclopropyl-1-ph...)
Affinity DataKi:  25.1nM. Assay description: The effect of compounds of the invention on human plasma kallikrein activity was determined using the chromogenic substrates. In these experiments, 2...
Ligand InfoPC cidPC sid
In DepthDetails US Patent
TargetPlasma kallikrein(Homo sapiens (Human))
Biocryst Pharmaceuticals
US Patent
LigandPNGBDBM416730(1-(3-(aminomethyl)phenyl)-N-(3-(3-cyclopropyl-1-ph...)
Affinity DataKi:  25.1nM. Assay description: The effect of compounds of the invention on human plasma kallikrein activity was determined using the chromogenic substrates (DiaPharma Group, Inc., ...
Ligand InfoPC cidPC sid
In DepthDetails US Patent
TargetPlasma kallikrein(Homo sapiens (Human))
Biocryst Pharmaceuticals
US Patent
LigandPNGBDBM416730(1-(3-(aminomethyl)phenyl)-N-(3-(3-cyclopropyl-1-ph...)
Affinity DataKi:  25.1nM. Assay description: Plasma kallikrein activity assay. The effect of compounds of the invention on human plasma kallikrein activity was determined using the chromogenic s...
Ligand InfoPC cidPC sid
In DepthDetails US Patent
TargetPlasma kallikrein(Homo sapiens (Human))
Biocryst Pharmaceuticals
US Patent
LigandPNGBDBM416730(1-(3-(aminomethyl)phenyl)-N-(3-(3-cyclopropyl-1-ph...)
Affinity DataKi:  25.1nM. Assay description: Plasma kallikrein activity assay. The effect of compounds of the invention on human plasma kallikrein activity was determined using the chromogenic s...
Ligand InfoPC cidPC sid
In DepthDetails US Patent
TargetPlasma kallikrein(Homo sapiens (Human))
Biocryst Pharmaceuticals
US Patent
LigandPNGBDBM416730(1-(3-(aminomethyl)phenyl)-N-(3-(3-cyclopropyl-1-ph...)
Affinity DataKi:  25.1nM. Assay description: The effect of compounds of the invention on human plasma kallikrein activity was determined using the chromogenic substrates (DiaPharma Group, Inc., ...
Ligand InfoPC cidPC sid
In DepthDetails US Patent
TargetPlasma kallikrein(Homo sapiens (Human))
Biocryst Pharmaceuticals
US Patent
LigandPNGBDBM416730(1-(3-(aminomethyl)phenyl)-N-(3-(3-cyclopropyl-1-ph...)
Affinity DataKi:  25.1nM. Assay description: The effect of compounds of the invention on human plasma kallikrein activity was determined using the chromogenic substrates (DiaPharma Group, Inc., ...
Ligand InfoPC cidPC sid
In DepthDetails US Patent
TargetPlasma kallikrein(Homo sapiens (Human))
Biocryst Pharmaceuticals
US Patent
LigandPNGBDBM416730(1-(3-(aminomethyl)phenyl)-N-(3-(3-cyclopropyl-1-ph...)
Affinity DataIC50:  10nM. Assay description: Inhibition of purified human plasma kallikrein using H-D-Pro-Phe-Arg-pNA.2HCl as substrate measured after 3 mins by microplate reader analysis
Ligand InfoPC cidPC sid
In DepthDetails PubMed
TargetPlasma kallikrein(Homo sapiens (Human))
Biocryst Pharmaceuticals
US Patent
LigandPNGBDBM416730(1-(3-(aminomethyl)phenyl)-N-(3-(3-cyclopropyl-1-ph...)
Affinity DataIC50:  2.03E+3nM. Assay description: Inhibition of endogenous human plasma kallikrein using Z-Phe-Arg-AMC.HCl as substrate measured after 5 mins by microplate reader analysis
Ligand InfoPC cidPC sid
In DepthDetails PubMed