BDBM416798 1-(3-(aminomethyl)phenyl)-N-(3-((cyclopropylmethylamino)(3-(methylsulfonyl)phenyl)methyl)phenyl)-3-(trifluoromethyl)-1H-pyrazole-5-carboxamide::US10329260, Compound 114f::US10633345, Compound 114f::US10689346, Compound 114f::US11203574, Compound 114f::US11230530, Compound 114f::US11685721, Compound 114f::US11708332, Compound 114f
SMILES CS(=O)(=O)c1cccc(c1)C(NCC1CC1)c1cccc(NC(=O)c2cc(nn2-c2cccc(CN)c2)C(F)(F)F)c1
InChI Key InChIKey=VJYAFYNZRBTGFW-UHFFFAOYSA-N
Data  8 KI
  Tab Delimited (TSV)   2D SDfile   Computed 3D by Vconf -m prep SDfile
Find this compound or compounds like it in BindingDB:
Activity Spreadsheet -- Enzyme Inhibition Constant Data from BindingDB
Found 8 hits for monomerid = 416798
TargetPlasma kallikrein(Homo sapiens (Human))
Biocryst Pharmaceuticals
US Patent
LigandPNGBDBM416798(1-(3-(aminomethyl)phenyl)-N-(3-((cyclopropylmethyl...)
Affinity DataKi:  25.1nM. Assay description: The effect of compounds of the invention on human plasma kallikrein activity was determined using the chromogenic substrates (DiaPharma Group, Inc., ...
Ligand InfoPC cidPC sid
In DepthDetails US Patent
TargetPlasma kallikrein(Homo sapiens (Human))
Biocryst Pharmaceuticals
US Patent
LigandPNGBDBM416798(1-(3-(aminomethyl)phenyl)-N-(3-((cyclopropylmethyl...)
Affinity DataKi:  25.1nM. Assay description: The effect of compounds of the invention on human plasma kallikrein activity was determined using the chromogenic substrates (DiaPharma Group, Inc., ...
Ligand InfoPC cidPC sid
In DepthDetails US Patent
TargetPlasma kallikrein(Homo sapiens (Human))
Biocryst Pharmaceuticals
US Patent
LigandPNGBDBM416798(1-(3-(aminomethyl)phenyl)-N-(3-((cyclopropylmethyl...)
Affinity DataKi:  25.1nM. Assay description: The effect of compounds of the invention on human plasma kallikrein activity was determined using the chromogenic substrates. In these experiments, 2...
Ligand InfoPC cidPC sid
In DepthDetails US Patent
TargetPlasma kallikrein(Homo sapiens (Human))
Biocryst Pharmaceuticals
US Patent
LigandPNGBDBM416798(1-(3-(aminomethyl)phenyl)-N-(3-((cyclopropylmethyl...)
Affinity DataKi:  25.1nM. Assay description: Plasma kallikrein activity assay. The effect of compounds of the invention on human plasma kallikrein activity was determined using the chromogenic s...
Ligand InfoPC cidPC sid
In DepthDetails US Patent
TargetPlasma kallikrein(Homo sapiens (Human))
Biocryst Pharmaceuticals
US Patent
LigandPNGBDBM416798(1-(3-(aminomethyl)phenyl)-N-(3-((cyclopropylmethyl...)
Affinity DataKi:  25.1nM. Assay description: Plasma kallikrein activity assay. The effect of compounds of the invention on human plasma kallikrein activity was determined using the chromogenic s...
Ligand InfoPC cidPC sid
In DepthDetails US Patent
TargetPlasma kallikrein(Homo sapiens (Human))
Biocryst Pharmaceuticals
US Patent
LigandPNGBDBM416798(1-(3-(aminomethyl)phenyl)-N-(3-((cyclopropylmethyl...)
Affinity DataKi:  25.1nM. Assay description: The effect of compounds of the invention on human plasma kallikrein activity was determined using the chromogenic substrates (DiaPharma Group, Inc., ...
Ligand InfoPC cidPC sid
In DepthDetails US Patent
TargetPlasma kallikrein(Homo sapiens (Human))
Biocryst Pharmaceuticals
US Patent
LigandPNGBDBM416798(1-(3-(aminomethyl)phenyl)-N-(3-((cyclopropylmethyl...)
Affinity DataKi:  25.1nM. Assay description: The effect of compounds of the invention on human plasma kallikrein activity was determined using the chromogenic substrates (DiaPharma Group, Inc., ...
Ligand InfoPC cidPC sid
In DepthDetails US Patent
TargetPlasma kallikrein(Homo sapiens (Human))
Biocryst Pharmaceuticals
US Patent
LigandPNGBDBM416798(1-(3-(aminomethyl)phenyl)-N-(3-((cyclopropylmethyl...)
Affinity DataKi:  25.1nM. Assay description: The effect of compounds of the invention on human plasma kallikrein activity was determined using the chromogenic substrates (DiaPharma Group, Inc., ...
Ligand InfoPC cidPC sid
In DepthDetails US Patent