BDBM416906 1-(3-(aminomethyl)phenyl)-N-(5-((cyclopropylmethylamino)(2-methoxynaphthalen-1-yl)methyl)-2-fluorophenyl)-3-(trifluoromethyl)-1H-pyrazole-5-carboxamide dihydrochloride::US10329260, Compound 61e::US10633345, Compound 63b::US10689346, Compound 61e::US11203574, Compound 63b::US11230530, Compound 63b::US11685721, Compound 63b::US11708332, Compound 63b
SMILES COc1ccc2ccccc2c1C(NCC1CC1)c1ccc(F)c(NC(=O)c2cc(nn2-c2cccc(CN)c2)C(F)(F)F)c1
InChI Key InChIKey=AYMFYNZEWAELBE-UHFFFAOYSA-N
Data  22 KI
  Tab Delimited (TSV)   2D SDfile   Computed 3D by Vconf -m prep SDfile
Find this compound or compounds like it in BindingDB:
Activity Spreadsheet -- Enzyme Inhibition Constant Data from BindingDB
Found 22 hits for monomerid = 416906
TargetPlasma kallikrein(Homo sapiens (Human))
Biocryst Pharmaceuticals
US Patent
LigandPNGBDBM416906(1-(3-(aminomethyl)phenyl)-N-(5-((cyclopropylmethyl...)
Affinity DataKi:  25.1nM. Assay description: The effect of compounds of the invention on human plasma kallikrein activity was determined using the chromogenic substrates (DiaPharma Group, Inc., ...
Ligand InfoPC cidPC sid
In DepthDetails US Patent
TargetPlasma kallikrein(Homo sapiens (Human))
Biocryst Pharmaceuticals
US Patent
LigandPNGBDBM416906(1-(3-(aminomethyl)phenyl)-N-(5-((cyclopropylmethyl...)
Affinity DataKi:  25.1nM. Assay description: Plasma kallikrein activity assay. The effect of compounds of the invention on human plasma kallikrein activity was determined using the chromogenic s...
Ligand InfoPC cidPC sid
In DepthDetails US Patent
TargetPlasma kallikrein(Homo sapiens (Human))
Biocryst Pharmaceuticals
US Patent
LigandPNGBDBM416906(1-(3-(aminomethyl)phenyl)-N-(5-((cyclopropylmethyl...)
Affinity DataKi:  25.1nM. Assay description: The effect of compounds of the invention on human plasma kallikrein activity was determined using the chromogenic substrates (DiaPharma Group, Inc., ...
Ligand InfoPC cidPC sid
In DepthDetails US Patent
TargetPlasma kallikrein(Homo sapiens (Human))
Biocryst Pharmaceuticals
US Patent
LigandPNGBDBM416906(1-(3-(aminomethyl)phenyl)-N-(5-((cyclopropylmethyl...)
Affinity DataKi:  25.1nM. Assay description: The effect of compounds of the invention on human plasma kallikrein activity was determined using the chromogenic substrates (DiaPharma Group, Inc., ...
Ligand InfoPC cidPC sid
In DepthDetails US Patent
TargetPlasma kallikrein(Homo sapiens (Human))
Biocryst Pharmaceuticals
US Patent
LigandPNGBDBM416906(1-(3-(aminomethyl)phenyl)-N-(5-((cyclopropylmethyl...)
Affinity DataKi:  25.1nM. Assay description: The effect of compounds of the invention on human plasma kallikrein activity was determined using the chromogenic substrates. In these experiments, 2...
Ligand InfoPC cidPC sid
In DepthDetails US Patent
TargetPlasma kallikrein(Homo sapiens (Human))
Biocryst Pharmaceuticals
US Patent
LigandPNGBDBM416906(1-(3-(aminomethyl)phenyl)-N-(5-((cyclopropylmethyl...)
Affinity DataKi:  25.1nM. Assay description: The effect of compounds of the invention on human plasma kallikrein activity was determined using the chromogenic substrates. In these experiments, 2...
Ligand InfoPC cidPC sid
In DepthDetails US Patent
TargetPlasma kallikrein(Homo sapiens (Human))
Biocryst Pharmaceuticals
US Patent
LigandPNGBDBM416906(1-(3-(aminomethyl)phenyl)-N-(5-((cyclopropylmethyl...)
Affinity DataKi:  25.1nM. Assay description: The effect of compounds of the invention on human plasma kallikrein activity was determined using the chromogenic substrates. In these experiments, 2...
Ligand InfoPC cidPC sid
In DepthDetails US Patent
TargetPlasma kallikrein(Homo sapiens (Human))
Biocryst Pharmaceuticals
US Patent
LigandPNGBDBM416906(1-(3-(aminomethyl)phenyl)-N-(5-((cyclopropylmethyl...)
Affinity DataKi:  25.1nM. Assay description: The effect of compounds of the invention on human plasma kallikrein activity was determined using the chromogenic substrates (DiaPharma Group, Inc., ...
Ligand InfoPC cidPC sid
In DepthDetails US Patent
TargetPlasma kallikrein(Homo sapiens (Human))
Biocryst Pharmaceuticals
US Patent
LigandPNGBDBM416906(1-(3-(aminomethyl)phenyl)-N-(5-((cyclopropylmethyl...)
Affinity DataKi:  25.1nM. Assay description: The effect of compounds of the invention on human plasma kallikrein activity was determined using the chromogenic substrates (DiaPharma Group, Inc., ...
Ligand InfoPC cidPC sid
In DepthDetails US Patent
TargetPlasma kallikrein(Homo sapiens (Human))
Biocryst Pharmaceuticals
US Patent
LigandPNGBDBM416906(1-(3-(aminomethyl)phenyl)-N-(5-((cyclopropylmethyl...)
Affinity DataKi:  25.1nM. Assay description: The effect of compounds of the invention on human plasma kallikrein activity was determined using the chromogenic substrates (DiaPharma Group, Inc., ...
Ligand InfoPC cidPC sid
In DepthDetails US Patent
TargetPlasma kallikrein(Homo sapiens (Human))
Biocryst Pharmaceuticals
US Patent
LigandPNGBDBM416906(1-(3-(aminomethyl)phenyl)-N-(5-((cyclopropylmethyl...)
Affinity DataKi:  25.1nM. Assay description: Plasma kallikrein activity assay. The effect of compounds of the invention on human plasma kallikrein activity was determined using the chromogenic s...
Ligand InfoPC cidPC sid
In DepthDetails US Patent
TargetPlasma kallikrein(Homo sapiens (Human))
Biocryst Pharmaceuticals
US Patent
LigandPNGBDBM416906(1-(3-(aminomethyl)phenyl)-N-(5-((cyclopropylmethyl...)
Affinity DataKi:  25.1nM. Assay description: Plasma kallikrein activity assay. The effect of compounds of the invention on human plasma kallikrein activity was determined using the chromogenic s...
Ligand InfoPC cidPC sid
In DepthDetails US Patent
TargetPlasma kallikrein(Homo sapiens (Human))
Biocryst Pharmaceuticals
US Patent
LigandPNGBDBM416906(1-(3-(aminomethyl)phenyl)-N-(5-((cyclopropylmethyl...)
Affinity DataKi:  25.1nM. Assay description: Plasma kallikrein activity assay. The effect of compounds of the invention on human plasma kallikrein activity was determined using the chromogenic s...
Ligand InfoPC cidPC sid
In DepthDetails US Patent
TargetPlasma kallikrein(Homo sapiens (Human))
Biocryst Pharmaceuticals
US Patent
LigandPNGBDBM416906(1-(3-(aminomethyl)phenyl)-N-(5-((cyclopropylmethyl...)
Affinity DataKi:  25.1nM. Assay description: The effect of compounds of the invention on human plasma kallikrein activity was determined using the chromogenic substrates (DiaPharma Group, Inc., ...
Ligand InfoPC cidPC sid
In DepthDetails US Patent
TargetPlasma kallikrein(Homo sapiens (Human))
Biocryst Pharmaceuticals
US Patent
LigandPNGBDBM416906(1-(3-(aminomethyl)phenyl)-N-(5-((cyclopropylmethyl...)
Affinity DataKi:  25.1nM. Assay description: The effect of compounds of the invention on human plasma kallikrein activity was determined using the chromogenic substrates (DiaPharma Group, Inc., ...
Ligand InfoPC cidPC sid
In DepthDetails US Patent
TargetPlasma kallikrein(Homo sapiens (Human))
Biocryst Pharmaceuticals
US Patent
LigandPNGBDBM416906(1-(3-(aminomethyl)phenyl)-N-(5-((cyclopropylmethyl...)
Affinity DataKi:  25.1nM. Assay description: The effect of compounds of the invention on human plasma kallikrein activity was determined using the chromogenic substrates (DiaPharma Group, Inc., ...
Ligand InfoPC cidPC sid
In DepthDetails US Patent
TargetPlasma kallikrein(Homo sapiens (Human))
Biocryst Pharmaceuticals
US Patent
LigandPNGBDBM416906(1-(3-(aminomethyl)phenyl)-N-(5-((cyclopropylmethyl...)
Affinity DataKi:  25.1nM. Assay description: Plasma kallikrein activity assay. The effect of compounds of the invention on human plasma kallikrein activity was determined using the chromogenic s...
Ligand InfoPC cidPC sid
In DepthDetails US Patent
TargetPlasma kallikrein(Homo sapiens (Human))
Biocryst Pharmaceuticals
US Patent
LigandPNGBDBM416906(1-(3-(aminomethyl)phenyl)-N-(5-((cyclopropylmethyl...)
Affinity DataKi:  25.1nM. Assay description: Plasma kallikrein activity assay. The effect of compounds of the invention on human plasma kallikrein activity was determined using the chromogenic s...
Ligand InfoPC cidPC sid
In DepthDetails US Patent
TargetPlasma kallikrein(Homo sapiens (Human))
Biocryst Pharmaceuticals
US Patent
LigandPNGBDBM416906(1-(3-(aminomethyl)phenyl)-N-(5-((cyclopropylmethyl...)
Affinity DataKi:  25.1nM. Assay description: The effect of compounds of the invention on human plasma kallikrein activity was determined using the chromogenic substrates (DiaPharma Group, Inc., ...
Ligand InfoPC cidPC sid
In DepthDetails US Patent
TargetPlasma kallikrein(Homo sapiens (Human))
Biocryst Pharmaceuticals
US Patent
LigandPNGBDBM416906(1-(3-(aminomethyl)phenyl)-N-(5-((cyclopropylmethyl...)
Affinity DataKi:  25.1nM. Assay description: The effect of compounds of the invention on human plasma kallikrein activity was determined using the chromogenic substrates (DiaPharma Group, Inc., ...
Ligand InfoPC cidPC sid
In DepthDetails US Patent
TargetPlasma kallikrein(Homo sapiens (Human))
Biocryst Pharmaceuticals
US Patent
LigandPNGBDBM416906(1-(3-(aminomethyl)phenyl)-N-(5-((cyclopropylmethyl...)
Affinity DataKi:  25.1nM. Assay description: The effect of compounds of the invention on human plasma kallikrein activity was determined using the chromogenic substrates (DiaPharma Group, Inc., ...
Ligand InfoPC cidPC sid
In DepthDetails US Patent
TargetPlasma kallikrein(Homo sapiens (Human))
Biocryst Pharmaceuticals
US Patent
LigandPNGBDBM416906(1-(3-(aminomethyl)phenyl)-N-(5-((cyclopropylmethyl...)
Affinity DataKi:  25.1nM. Assay description: The effect of compounds of the invention on human plasma kallikrein activity was determined using the chromogenic substrates (DiaPharma Group, Inc., ...
Ligand InfoPC cidPC sid
In DepthDetails US Patent