BDBM416936 1-(3-(aminomethyl)phenyl)-N-(3-(3-cyclopropyl-1-(2-oxopyrrolidin-1-yl)propyl)phenyl)-3-(trifluoromethyl)-1H-pyrazole-5-carboxamide::US10329260, Compound 247e::US10633345, Compound 247e::US10689346, Compound 247e::US11203574, Compound 247e::US11230530, Compound 247e::US11685721, Compound 247e::US11708332, Compound 247e
SMILES NCc1cccc(c1)-n1nc(cc1C(=O)Nc1cccc(c1)C(CCC1CC1)N1CCCC1=O)C(F)(F)F
InChI Key InChIKey=LEZWAIIPWSOOAE-UHFFFAOYSA-N
Data  8 KI
  Tab Delimited (TSV)   2D SDfile   Computed 3D by Vconf -m prep SDfile
Find this compound or compounds like it in BindingDB:
Activity Spreadsheet -- Enzyme Inhibition Constant Data from BindingDB
Found 8 hits for monomerid = 416936
TargetPlasma kallikrein(Homo sapiens (Human))
Biocryst Pharmaceuticals
US Patent
LigandPNGBDBM416936(1-(3-(aminomethyl)phenyl)-N-(3-(3-cyclopropyl-1-(2...)
Affinity DataKi:  25.1nM. Assay description: The effect of compounds of the invention on human plasma kallikrein activity was determined using the chromogenic substrates (DiaPharma Group, Inc., ...
Ligand InfoPC cidPC sid
In DepthDetails US Patent
TargetPlasma kallikrein(Homo sapiens (Human))
Biocryst Pharmaceuticals
US Patent
LigandPNGBDBM416936(1-(3-(aminomethyl)phenyl)-N-(3-(3-cyclopropyl-1-(2...)
Affinity DataKi:  25.1nM. Assay description: The effect of compounds of the invention on human plasma kallikrein activity was determined using the chromogenic substrates (DiaPharma Group, Inc., ...
Ligand InfoPC cidPC sid
In DepthDetails US Patent
TargetPlasma kallikrein(Homo sapiens (Human))
Biocryst Pharmaceuticals
US Patent
LigandPNGBDBM416936(1-(3-(aminomethyl)phenyl)-N-(3-(3-cyclopropyl-1-(2...)
Affinity DataKi:  25.1nM. Assay description: The effect of compounds of the invention on human plasma kallikrein activity was determined using the chromogenic substrates. In these experiments, 2...
Ligand InfoPC cidPC sid
In DepthDetails US Patent
TargetPlasma kallikrein(Homo sapiens (Human))
Biocryst Pharmaceuticals
US Patent
LigandPNGBDBM416936(1-(3-(aminomethyl)phenyl)-N-(3-(3-cyclopropyl-1-(2...)
Affinity DataKi:  25.1nM. Assay description: The effect of compounds of the invention on human plasma kallikrein activity was determined using the chromogenic substrates (DiaPharma Group, Inc., ...
Ligand InfoPC cidPC sid
In DepthDetails US Patent
TargetPlasma kallikrein(Homo sapiens (Human))
Biocryst Pharmaceuticals
US Patent
LigandPNGBDBM416936(1-(3-(aminomethyl)phenyl)-N-(3-(3-cyclopropyl-1-(2...)
Affinity DataKi:  25.1nM. Assay description: Plasma kallikrein activity assay. The effect of compounds of the invention on human plasma kallikrein activity was determined using the chromogenic s...
Ligand InfoPC cidPC sid
In DepthDetails US Patent
TargetPlasma kallikrein(Homo sapiens (Human))
Biocryst Pharmaceuticals
US Patent
LigandPNGBDBM416936(1-(3-(aminomethyl)phenyl)-N-(3-(3-cyclopropyl-1-(2...)
Affinity DataKi:  25.1nM. Assay description: The effect of compounds of the invention on human plasma kallikrein activity was determined using the chromogenic substrates (DiaPharma Group, Inc., ...
Ligand InfoPC cidPC sid
In DepthDetails US Patent
TargetPlasma kallikrein(Homo sapiens (Human))
Biocryst Pharmaceuticals
US Patent
LigandPNGBDBM416936(1-(3-(aminomethyl)phenyl)-N-(3-(3-cyclopropyl-1-(2...)
Affinity DataKi:  25.1nM. Assay description: Plasma kallikrein activity assay. The effect of compounds of the invention on human plasma kallikrein activity was determined using the chromogenic s...
Ligand InfoPC cidPC sid
In DepthDetails US Patent
TargetPlasma kallikrein(Homo sapiens (Human))
Biocryst Pharmaceuticals
US Patent
LigandPNGBDBM416936(1-(3-(aminomethyl)phenyl)-N-(3-(3-cyclopropyl-1-(2...)
Affinity DataKi:  25.1nM. Assay description: The effect of compounds of the invention on human plasma kallikrein activity was determined using the chromogenic substrates (DiaPharma Group, Inc., ...
Ligand InfoPC cidPC sid
In DepthDetails US Patent