BDBM416970 (+-)-1-(3-(aminomethyl)phenyl)-N-(3-((cyclopropylmethylamino)(2-hydroxyphenyl)methyl)phenyl)-3-(trifluoromethyl)-1H-pyrazole-5-carboxamide::US10329260, Compound 49j
SMILES NCc1cccc(c1)-n1nc(cc1C(=O)Nc1cccc(c1)C(NCC1CC1)c1ccccc1O)C(F)(F)F
InChI Key InChIKey=PCNDJIQOMLHSEK-UHFFFAOYSA-N
Data  1 KI
  Tab Delimited (TSV)   2D SDfile   Computed 3D by Vconf -m prep SDfile
Find this compound or compounds like it in BindingDB:
Activity Spreadsheet -- Enzyme Inhibition Constant Data from BindingDB
Found 1 hit for monomerid = 416970
TargetPlasma kallikrein(Homo sapiens (Human))
Biocryst Pharmaceuticals
US Patent
LigandPNGBDBM416970((+-)-1-(3-(aminomethyl)phenyl)-N-(3-((cyclopropylm...)
Affinity DataKi:  25.1nM. Assay description: The effect of compounds of the invention on human plasma kallikrein activity was determined using the chromogenic substrates (DiaPharma Group, Inc., ...
Ligand InfoPC cidPC sid
In DepthDetails US Patent