BDBM416981 (+)-N-(5-(1-amino-3-cyclopropyl-1-(pyridin-3-yl)propyl)-2-fluorophenyl)-1-(3-(aminomethyl)phenyl)-3-(trifluoromethyl)-1H-pyrazole-5-carboxamide::US10329260, Compound 208d::US10633345, Compound 209d::US10689346, Compound 209d::US11203574, Compound 209d::US11230530, Compound 209d::US11685721, Compound 209d::US11708332, Compound 209d
SMILES NCc1cccc(c1)-n1nc(cc1C(=O)Nc1cc(ccc1F)C(N)(CCC1CC1)c1cccnc1)C(F)(F)F
InChI Key InChIKey=QXMQDWOYOXVOQZ-UHFFFAOYSA-N
Data  15 KI  4 IC50
  Tab Delimited (TSV)   2D SDfile   Computed 3D by Vconf -m prep SDfile
Find this compound or compounds like it in BindingDB:
Activity Spreadsheet -- Enzyme Inhibition Constant Data from BindingDB
Found 19 hits for monomerid = 416981
TargetPlasma kallikrein(Homo sapiens (Human))
Biocryst Pharmaceuticals
US Patent
LigandPNGBDBM416981((+)-N-(5-(1-amino-3-cyclopropyl-1-(pyridin-3-yl)pr...)
Affinity DataKi:  25.1nM. Assay description: The effect of compounds of the invention on human plasma kallikrein activity was determined using the chromogenic substrates (DiaPharma Group, Inc., ...
Ligand InfoPC cidPC sid
In DepthDetails US Patent
TargetPlasma kallikrein(Homo sapiens (Human))
Biocryst Pharmaceuticals
US Patent
LigandPNGBDBM416981((+)-N-(5-(1-amino-3-cyclopropyl-1-(pyridin-3-yl)pr...)
Affinity DataKi:  25.1nM. Assay description: The effect of compounds of the invention on human plasma kallikrein activity was determined using the chromogenic substrates (DiaPharma Group, Inc., ...
Ligand InfoPC cidPC sid
In DepthDetails US Patent
TargetPlasma kallikrein(Homo sapiens (Human))
Biocryst Pharmaceuticals
US Patent
LigandPNGBDBM416981((+)-N-(5-(1-amino-3-cyclopropyl-1-(pyridin-3-yl)pr...)
Affinity DataKi:  25.1nM. Assay description: The effect of compounds of the invention on human plasma kallikrein activity was determined using the chromogenic substrates (DiaPharma Group, Inc., ...
Ligand InfoPC cidPC sid
In DepthDetails US Patent
TargetPlasma kallikrein(Homo sapiens (Human))
Biocryst Pharmaceuticals
US Patent
LigandPNGBDBM416981((+)-N-(5-(1-amino-3-cyclopropyl-1-(pyridin-3-yl)pr...)
Affinity DataKi:  25.1nM. Assay description: The effect of compounds of the invention on human plasma kallikrein activity was determined using the chromogenic substrates (DiaPharma Group, Inc., ...
Ligand InfoPC cidPC sid
In DepthDetails US Patent
TargetPlasma kallikrein(Homo sapiens (Human))
Biocryst Pharmaceuticals
US Patent
LigandPNGBDBM416981((+)-N-(5-(1-amino-3-cyclopropyl-1-(pyridin-3-yl)pr...)
Affinity DataKi:  25.1nM. Assay description: Plasma kallikrein activity assay. The effect of compounds of the invention on human plasma kallikrein activity was determined using the chromogenic s...
Ligand InfoPC cidPC sid
In DepthDetails US Patent
TargetPlasma kallikrein(Homo sapiens (Human))
Biocryst Pharmaceuticals
US Patent
LigandPNGBDBM416981((+)-N-(5-(1-amino-3-cyclopropyl-1-(pyridin-3-yl)pr...)
Affinity DataKi:  25.1nM. Assay description: The effect of compounds of the invention on human plasma kallikrein activity was determined using the chromogenic substrates (DiaPharma Group, Inc., ...
Ligand InfoPC cidPC sid
In DepthDetails US Patent
TargetPlasma kallikrein(Homo sapiens (Human))
Biocryst Pharmaceuticals
US Patent
LigandPNGBDBM416981((+)-N-(5-(1-amino-3-cyclopropyl-1-(pyridin-3-yl)pr...)
Affinity DataKi:  25.1nM. Assay description: The effect of compounds of the invention on human plasma kallikrein activity was determined using the chromogenic substrates. In these experiments, 2...
Ligand InfoPC cidPC sid
In DepthDetails US Patent
TargetPlasma kallikrein(Homo sapiens (Human))
Biocryst Pharmaceuticals
US Patent
LigandPNGBDBM416981((+)-N-(5-(1-amino-3-cyclopropyl-1-(pyridin-3-yl)pr...)
Affinity DataKi:  25.1nM. Assay description: The effect of compounds of the invention on human plasma kallikrein activity was determined using the chromogenic substrates. In these experiments, 2...
Ligand InfoPC cidPC sid
In DepthDetails US Patent
TargetPlasma kallikrein(Homo sapiens (Human))
Biocryst Pharmaceuticals
US Patent
LigandPNGBDBM416981((+)-N-(5-(1-amino-3-cyclopropyl-1-(pyridin-3-yl)pr...)
Affinity DataKi:  25.1nM. Assay description: The effect of compounds of the invention on human plasma kallikrein activity was determined using the chromogenic substrates (DiaPharma Group, Inc., ...
Ligand InfoPC cidPC sid
In DepthDetails US Patent
TargetPlasma kallikrein(Homo sapiens (Human))
Biocryst Pharmaceuticals
US Patent
LigandPNGBDBM416981((+)-N-(5-(1-amino-3-cyclopropyl-1-(pyridin-3-yl)pr...)
Affinity DataKi:  25.1nM. Assay description: The effect of compounds of the invention on human plasma kallikrein activity was determined using the chromogenic substrates (DiaPharma Group, Inc., ...
Ligand InfoPC cidPC sid
In DepthDetails US Patent
TargetPlasma kallikrein(Homo sapiens (Human))
Biocryst Pharmaceuticals
US Patent
LigandPNGBDBM416981((+)-N-(5-(1-amino-3-cyclopropyl-1-(pyridin-3-yl)pr...)
Affinity DataKi:  25.1nM. Assay description: Plasma kallikrein activity assay. The effect of compounds of the invention on human plasma kallikrein activity was determined using the chromogenic s...
Ligand InfoPC cidPC sid
In DepthDetails US Patent
TargetPlasma kallikrein(Homo sapiens (Human))
Biocryst Pharmaceuticals
US Patent
LigandPNGBDBM416981((+)-N-(5-(1-amino-3-cyclopropyl-1-(pyridin-3-yl)pr...)
Affinity DataKi:  25.1nM. Assay description: Plasma kallikrein activity assay. The effect of compounds of the invention on human plasma kallikrein activity was determined using the chromogenic s...
Ligand InfoPC cidPC sid
In DepthDetails US Patent
TargetPlasma kallikrein(Homo sapiens (Human))
Biocryst Pharmaceuticals
US Patent
LigandPNGBDBM416981((+)-N-(5-(1-amino-3-cyclopropyl-1-(pyridin-3-yl)pr...)
Affinity DataKi:  25.1nM. Assay description: The effect of compounds of the invention on human plasma kallikrein activity was determined using the chromogenic substrates (DiaPharma Group, Inc., ...
Ligand InfoPC cidPC sid
In DepthDetails US Patent
TargetPlasma kallikrein(Homo sapiens (Human))
Biocryst Pharmaceuticals
US Patent
LigandPNGBDBM416981((+)-N-(5-(1-amino-3-cyclopropyl-1-(pyridin-3-yl)pr...)
Affinity DataKi:  25.1nM. Assay description: The effect of compounds of the invention on human plasma kallikrein activity was determined using the chromogenic substrates (DiaPharma Group, Inc., ...
Ligand InfoPC cidPC sid
In DepthDetails US Patent
TargetPlasma kallikrein(Homo sapiens (Human))
Biocryst Pharmaceuticals
US Patent
LigandPNGBDBM416981((+)-N-(5-(1-amino-3-cyclopropyl-1-(pyridin-3-yl)pr...)
Affinity DataKi:  25.1nM. Assay description: Plasma kallikrein activity assay. The effect of compounds of the invention on human plasma kallikrein activity was determined using the chromogenic s...
Ligand InfoPC cidPC sid
In DepthDetails US Patent
TargetPlasma kallikrein(Homo sapiens (Human))
Biocryst Pharmaceuticals
US Patent
LigandPNGBDBM416981((+)-N-(5-(1-amino-3-cyclopropyl-1-(pyridin-3-yl)pr...)
Affinity DataIC50:  0.660nM. Assay description: Inhibition of purified human plasma kallikrein using H-D-Pro-Phe-Arg-pNA.2HCl as substrate measured after 3 mins by microplate reader analysis
Ligand InfoPC cidPC sid
In DepthDetails PubMed
TargetPlasma kallikrein(Homo sapiens (Human))
Biocryst Pharmaceuticals
US Patent
LigandPNGBDBM416981((+)-N-(5-(1-amino-3-cyclopropyl-1-(pyridin-3-yl)pr...)
Affinity DataIC50:  0.660nM. Assay description: Inhibition of purified human plasma kallikrein using H-D-Pro-Phe-Arg-pNA.2HCl as substrate measured after 3 mins by microplate reader analysis
Ligand InfoPC cidPC sid
In DepthDetails PubMed
TargetPlasma kallikrein(Homo sapiens (Human))
Biocryst Pharmaceuticals
US Patent
LigandPNGBDBM416981((+)-N-(5-(1-amino-3-cyclopropyl-1-(pyridin-3-yl)pr...)
Affinity DataIC50:  8nM. Assay description: Inhibition of endogenous human plasma kallikrein using Z-Phe-Arg-AMC.HCl as substrate measured after 5 mins by microplate reader analysis
Ligand InfoPC cidPC sid
In DepthDetails PubMed
TargetPlasma kallikrein(Homo sapiens (Human))
Biocryst Pharmaceuticals
US Patent
LigandPNGBDBM416981((+)-N-(5-(1-amino-3-cyclopropyl-1-(pyridin-3-yl)pr...)
Affinity DataIC50:  8nM. Assay description: Inhibition of endogenous human plasma kallikrein using Z-Phe-Arg-AMC.HCl as substrate measured after 5 mins by microplate reader analysis
Ligand InfoPC cidPC sid
In DepthDetails PubMed