BDBM416989 (+)-N-(5-(1-amino-3-cyclopropyl-1-(pyridin-4-yl)propyl)-2-fluorophenyl)-1-(1-aminoisoquinolin-7-yl)-3-(trifluoromethyl)-1H-pyrazole-5-carboxamide::US10329260, Compound 253e::US10633345, Compound 253e::US10689346, Compound 253e::US11203574, Compound 253e::US11230530, Compound 253e::US11685721, Compound 253e::US11708332, Compound 253e
SMILES Nc1nccc2ccc(cc12)-n1nc(cc1C(=O)Nc1cc(ccc1F)C(N)(CCC1CC1)c1ccncc1)C(F)(F)F
InChI Key InChIKey=BGYDOWYGLFEYGE-UHFFFAOYSA-N
Data  8 KI
  Tab Delimited (TSV)   2D SDfile   Computed 3D by Vconf -m prep SDfile
Find this compound or compounds like it in BindingDB:
Activity Spreadsheet -- Enzyme Inhibition Constant Data from BindingDB
Found 8 hits for monomerid = 416989
TargetPlasma kallikrein(Homo sapiens (Human))
Biocryst Pharmaceuticals
US Patent
LigandPNGBDBM416989((+)-N-(5-(1-amino-3-cyclopropyl-1-(pyridin-4-yl)pr...)
Affinity DataKi:  25.1nM. Assay description: The effect of compounds of the invention on human plasma kallikrein activity was determined using the chromogenic substrates (DiaPharma Group, Inc., ...
Ligand InfoPC cidPC sid
In DepthDetails US Patent
TargetPlasma kallikrein(Homo sapiens (Human))
Biocryst Pharmaceuticals
US Patent
LigandPNGBDBM416989((+)-N-(5-(1-amino-3-cyclopropyl-1-(pyridin-4-yl)pr...)
Affinity DataKi:  25.1nM. Assay description: The effect of compounds of the invention on human plasma kallikrein activity was determined using the chromogenic substrates (DiaPharma Group, Inc., ...
Ligand InfoPC cidPC sid
In DepthDetails US Patent
TargetPlasma kallikrein(Homo sapiens (Human))
Biocryst Pharmaceuticals
US Patent
LigandPNGBDBM416989((+)-N-(5-(1-amino-3-cyclopropyl-1-(pyridin-4-yl)pr...)
Affinity DataKi:  25.1nM. Assay description: The effect of compounds of the invention on human plasma kallikrein activity was determined using the chromogenic substrates. In these experiments, 2...
Ligand InfoPC cidPC sid
In DepthDetails US Patent
TargetPlasma kallikrein(Homo sapiens (Human))
Biocryst Pharmaceuticals
US Patent
LigandPNGBDBM416989((+)-N-(5-(1-amino-3-cyclopropyl-1-(pyridin-4-yl)pr...)
Affinity DataKi:  25.1nM. Assay description: The effect of compounds of the invention on human plasma kallikrein activity was determined using the chromogenic substrates (DiaPharma Group, Inc., ...
Ligand InfoPC cidPC sid
In DepthDetails US Patent
TargetPlasma kallikrein(Homo sapiens (Human))
Biocryst Pharmaceuticals
US Patent
LigandPNGBDBM416989((+)-N-(5-(1-amino-3-cyclopropyl-1-(pyridin-4-yl)pr...)
Affinity DataKi:  25.1nM. Assay description: Plasma kallikrein activity assay. The effect of compounds of the invention on human plasma kallikrein activity was determined using the chromogenic s...
Ligand InfoPC cidPC sid
In DepthDetails US Patent
TargetPlasma kallikrein(Homo sapiens (Human))
Biocryst Pharmaceuticals
US Patent
LigandPNGBDBM416989((+)-N-(5-(1-amino-3-cyclopropyl-1-(pyridin-4-yl)pr...)
Affinity DataKi:  25.1nM. Assay description: The effect of compounds of the invention on human plasma kallikrein activity was determined using the chromogenic substrates (DiaPharma Group, Inc., ...
Ligand InfoPC cidPC sid
In DepthDetails US Patent
TargetPlasma kallikrein(Homo sapiens (Human))
Biocryst Pharmaceuticals
US Patent
LigandPNGBDBM416989((+)-N-(5-(1-amino-3-cyclopropyl-1-(pyridin-4-yl)pr...)
Affinity DataKi:  25.1nM. Assay description: Plasma kallikrein activity assay. The effect of compounds of the invention on human plasma kallikrein activity was determined using the chromogenic s...
Ligand InfoPC cidPC sid
In DepthDetails US Patent
TargetPlasma kallikrein(Homo sapiens (Human))
Biocryst Pharmaceuticals
US Patent
LigandPNGBDBM416989((+)-N-(5-(1-amino-3-cyclopropyl-1-(pyridin-4-yl)pr...)
Affinity DataKi:  25.1nM. Assay description: The effect of compounds of the invention on human plasma kallikrein activity was determined using the chromogenic substrates (DiaPharma Group, Inc., ...
Ligand InfoPC cidPC sid
In DepthDetails US Patent