BDBM417050 1-(4-fluorophenyl)-4-(3-phenylpropoxy)pyridin-2(1H)-one::US10399948, Compound 2
SMILES Fc1ccc(cc1)-n1ccc(OCCCc2ccccc2)cc1=O
InChI Key InChIKey=GNGPAKSDCLQDST-UHFFFAOYSA-N
Data  2 IC50
  Tab Delimited (TSV)   2D SDfile   Computed 3D by Vconf -m prep SDfile
Find this compound or compounds like it in BindingDB:
Activity Spreadsheet -- Enzyme Inhibition Constant Data from BindingDB
Found 2 hits for monomerid = 417050
TargetMetabotropic glutamate receptor 2(Rattus norvegicus)
Vanderbilt University
US Patent
LigandPNGBDBM417050(1-(4-fluorophenyl)-4-(3-phenylpropoxy)pyridin-2(1H...)
Affinity DataIC50: >3.00E+4nM. Assay description: Gα15 HEK293 cells stably expressing rat mGlu2 were plated in black-walled, clear-bottomed, poly-D-lysine coated 384-well plates in 20 μL of...
Ligand InfoPC cidPC sid
In DepthDetails US Patent
TargetMetabotropic glutamate receptor 3(Rattus norvegicus (Rat))
Vanderbilt University
US Patent
LigandPNGBDBM417050(1-(4-fluorophenyl)-4-(3-phenylpropoxy)pyridin-2(1H...)
Affinity DataIC50:  5.41E+3nM. Assay description: Gα15/TREx cells stably expressing rat mGlu3 were plated in black-walled, clear-bottomed, poly-D-lysine coated 384-well plates in 20 μL of a...
Ligand InfoPC cidPC sid
In DepthDetails US Patent