BDBM417111 1-((3R,5S)-1-acryloyl-5-methylpyrrolidin-3-yl)-4-amino-N-(2-chloro-4-(2-dimethylamino)-2-oxoethyl)phenyl)-1H-pyrazolo[3,4-d]pyrimidine-3-carboxamide::US10329300, Example 78
SMILES C[C@H]1CN(C[C@@H]1n1nc(C(=O)Nc2ccc(CC(=O)N(C)C)cc2Cl)c2c(N)ncnc12)C(=O)C=C
InChI Key InChIKey=QPRWSDJDCLWFBD-GUYCJALGSA-N
Data  1 IC50
  Tab Delimited (TSV)   2D SDfile   Computed 3D by Vconf -m prep SDfile
Find this compound or compounds like it in BindingDB:
Activity Spreadsheet -- Enzyme Inhibition Constant Data from BindingDB
Found 1 hit for monomerid = 417111
TargetReceptor tyrosine-protein kinase erbB-2(Homo sapiens (Human))
Taiho Pharmaceutical
US Patent
LigandPNGBDBM417111(1-((3R,5S)-1-acryloyl-5-methylpyrrolidin-3-yl)-4-a...)
Affinity DataIC50:  14nM. Assay description: For setting the conditions for the method for measuring the in vitro inhibitory activity of a compound against HER2-phosphorylating activity, Profile...
Ligand InfoPC cidPC sid
In DepthDetails US Patent