BDBM417381 US10457654, Example 237
SMILES CN(C)[C@H]1C[C@H](CC[C@@H]1Nc1ccc(c(F)c1)S(=O)(=O)Nc1ccncn1)c1cccc(c1)C(F)(F)F
InChI Key InChIKey=OASKTWJFUMWDFE-HSQYWUDLSA-N
Data  2 IC50
  Tab Delimited (TSV)   2D SDfile   Computed 3D by Vconf -m prep SDfile
Find this compound or compounds like it in BindingDB:
Activity Spreadsheet -- Enzyme Inhibition Constant Data from BindingDB
Found 2 hits for monomerid = 417381
TargetSodium channel protein type 9 subunit alpha(Homo sapiens (Human))
Genentech
US Patent
LigandPNGBDBM417381(US10457654, Example 237)
Affinity DataIC50:  1.07nM. Assay description: Patch voltage clamp electrophysiology allows for the direct measurement and quantification of block of voltage-gated sodium channels (NaV's), and...
Ligand InfoPC cidPC sid
In DepthDetails US Patent
TargetSodium channel protein type 9 subunit alpha(Homo sapiens (Human))
Genentech
US Patent
LigandPNGBDBM417381(US10457654, Example 237)
Affinity DataIC50:  2.43nM. Assay description: Preparation of membranes containing recombinantly expressed sodium channels: Following the procedure described in Example 243A, and making modificati...
Ligand InfoPC cidPC sid
In DepthDetails US Patent