BDBM41762 5,5-dimethyl-3-(4-pyridylmethylamino)cyclohex-2-en-1-one::5,5-dimethyl-3-(pyridin-4-ylmethylamino)-1-cyclohex-2-enone::5,5-dimethyl-3-(pyridin-4-ylmethylamino)cyclohex-2-en-1-one::MLS000038448::SMR000036470::cid_658329
SMILES CC1(C)CC(=O)C=C(C1)NCc1ccncc1
InChI Key InChIKey=CEJRNMJRBUFLIR-UHFFFAOYSA-N
Data  1 IC50  2 EC50
  Tab Delimited (TSV)   2D SDfile   Computed 3D by Vconf -m prep SDfile
Find this compound or compounds like it in BindingDB:
Activity Spreadsheet -- Enzyme Inhibition Constant Data from BindingDB
Found 3 hits for monomerid = 41762
TargetSerine/threonine-protein kinase PLK1(Homo sapiens (Human))
University Of Pittsburgh
Curated by PubChem BioAssay
LigandPNGBDBM41762(5,5-dimethyl-3-(4-pyridylmethylamino)cyclohex-2-en...)
Affinity DataEC50: >5.00E+4nM. Assay description: List of compounds to be tested: Compounds that met the active criterion of Z-score is
In DepthDetails PCBioAssay
TargetSerine/threonine-protein kinase PLK1(Homo sapiens (Human))
University Of Pittsburgh
Curated by PubChem BioAssay
LigandPNGBDBM41762(5,5-dimethyl-3-(4-pyridylmethylamino)cyclohex-2-en...)
Affinity DataEC50: >5.00E+4nM. Assay description: List of compounds to be tested: Compounds that met the active criterion of Z-score is
In DepthDetails PCBioAssay
TargetSerine/threonine-protein kinase PLK1(Homo sapiens (Human))
University Of Pittsburgh
Curated by PubChem BioAssay
LigandPNGBDBM41762(5,5-dimethyl-3-(4-pyridylmethylamino)cyclohex-2-en...)
Affinity DataIC50: >5.00E+4nM. Assay description: List of compounds to be tested: Compounds that met the active criterion of Z-score is
In DepthDetails PCBioAssay