BDBM418459 1-(3-Fluoro-5-methylpyridin- 2-yl)-7-methoxy-3-methyl-8- (1-methyl-1H-pyrazol-4-yl)- 1,3-dihydroimidazo[4,5-c] quinolin-2-one::US10457677, Example 27::US10745399, Example 27::US10975075, Example 27::US11608338, Example 27
SMILES COc1cc2ncc3n(C)c(=O)n(-c4ncc(C)cc4F)c3c2cc1-c1cnn(C)c1
InChI Key InChIKey=PDIVCWBPIWEIAU-UHFFFAOYSA-N
Data  27 IC50
  Tab Delimited (TSV)   2D SDfile   Computed 3D by Vconf -m prep SDfile
Find this compound or compounds like it in BindingDB:
Activity Spreadsheet -- Enzyme Inhibition Constant Data from BindingDB
Found 27 hits for monomerid = 418459
TargetSerine-protein kinase ATM(Homo sapiens (Human))
Merck Patent
US Patent
LigandPNGBDBM418459(1-(3-Fluoro-5-methylpyridin- 2-yl)-7-methoxy-3-met...)
Affinity DataIC50: <1nM. Assay description: The IC50 value was determined with the aid of a biochemical ATM kinase assay. The assay consists of two steps: the enzymatic reaction and the detecti...
Ligand InfoPC cidPC sid
In DepthDetails US Patent
TargetSerine/threonine-protein kinase mTOR(Homo sapiens (Human))
Merck Patent
US Patent
LigandPNGBDBM418459(1-(3-Fluoro-5-methylpyridin- 2-yl)-7-methoxy-3-met...)
Affinity DataIC50: >3.00E+4nM. Assay description: The IC50 value was determined with the aid of a biochemical ATM kinase assay. The assay consists of two steps: the enzymatic reaction and the detecti...
Ligand InfoPC cidPC sid
In DepthDetails US Patent
LigandPNGBDBM418459(1-(3-Fluoro-5-methylpyridin- 2-yl)-7-methoxy-3-met...)
Affinity DataIC50: >3.00E+4nM. Assay description: PI3K p110α/p85α (human) was incubated in an assay buffer comprising 10 μM phosphati-dylinositol 4,5-bisphosphate and MgATP (concentrat...
Ligand InfoPC cidPC sid
In DepthDetails US Patent
LigandPNGBDBM418459(1-(3-Fluoro-5-methylpyridin- 2-yl)-7-methoxy-3-met...)
Affinity DataIC50: >3.00E+4nM. Assay description: PI3K p110β/p85α (human) was incubated in an assay buffer comprising 10 μM phosphati-dylinositol 4,5-bisphosphate and MgATP (concentrat...
Ligand InfoPC cidPC sid
In DepthDetails US Patent
LigandPNGBDBM418459(1-(3-Fluoro-5-methylpyridin- 2-yl)-7-methoxy-3-met...)
Affinity DataIC50: >3.00E+4nM. Assay description: PI3K p110δ/p85α (human) was incubated in an assay buffer comprising 10 μM phosphati-dylinositol 4,5-bisphosphate and MgATP (concentrat...
Ligand InfoPC cidPC sid
In DepthDetails US Patent
LigandPNGBDBM418459(1-(3-Fluoro-5-methylpyridin- 2-yl)-7-methoxy-3-met...)
Affinity DataIC50: >3.00E+4nM. Assay description: PI3K (p120γ) (human) was incubated in an assay buffer comprising 10 μM phosphati-dylinositol 4,5-bisphosphate and MgATP (concentration as n...
Ligand InfoPC cidPC sid
In DepthDetails US Patent
TargetSerine/threonine-protein kinase mTOR(Homo sapiens (Human))
Merck Patent
US Patent
LigandPNGBDBM418459(1-(3-Fluoro-5-methylpyridin- 2-yl)-7-methoxy-3-met...)
Affinity DataIC50: >3.00E+4nM. Assay description: mTOR (human) was incubated with 50 mM HEPES pH 7.5, 1 mM EGTA, 0.01% Tween 20, 2 mg/ml of the substrate, 3 mM MnCl2 and [γ-33P-ATP] (specific ac...
Ligand InfoPC cidPC sid
In DepthDetails US Patent
TargetSerine-protein kinase ATM(Homo sapiens (Human))
Merck Patent
US Patent
LigandPNGBDBM418459(1-(3-Fluoro-5-methylpyridin- 2-yl)-7-methoxy-3-met...)
Affinity DataIC50: <1nM. Assay description: The IC50 value was determined with the aid of a biochemical ATM kinase assay. The assay consists of two steps: the enzymatic reaction and the detecti...
Ligand InfoPC cidPC sid
In DepthDetails US Patent
LigandPNGBDBM418459(1-(3-Fluoro-5-methylpyridin- 2-yl)-7-methoxy-3-met...)
Affinity DataIC50: >3.00E+4nM. Assay description: PI3K p110α/p85α (human) was incubated in an assay buffer comprising 10 μM phosphatidylinositol 4,5-bisphosphate and MgATP (concentrati...
Ligand InfoPC cidPC sid
In DepthDetails US Patent
LigandPNGBDBM418459(1-(3-Fluoro-5-methylpyridin- 2-yl)-7-methoxy-3-met...)
Affinity DataIC50: >3.00E+4nM. Assay description: PI3K p110β/p85α (human) was incubated in an assay buffer comprising 10 μM phosphatidylinositol 4,5-bisphosphate and MgATP (concentrati...
Ligand InfoPC cidPC sid
In DepthDetails US Patent
LigandPNGBDBM418459(1-(3-Fluoro-5-methylpyridin- 2-yl)-7-methoxy-3-met...)
Affinity DataIC50: >3.00E+4nM. Assay description: PI3K p110δ/p85α (human) was incubated in an assay buffer comprising 10 μM phosphatidylinositol 4,5-bisphosphate and MgATP (concentrati...
Ligand InfoPC cidPC sid
In DepthDetails US Patent
LigandPNGBDBM418459(1-(3-Fluoro-5-methylpyridin- 2-yl)-7-methoxy-3-met...)
Affinity DataIC50: >3.00E+4nM. Assay description: PI3K (p120γ) (human) was incubated in an assay buffer comprising 10 μM phosphatidylinositol 4,5-bisphosphate and MgATP (concentration as ne...
Ligand InfoPC cidPC sid
In DepthDetails US Patent
TargetSerine/threonine-protein kinase mTOR(Homo sapiens (Human))
Merck Patent
US Patent
LigandPNGBDBM418459(1-(3-Fluoro-5-methylpyridin- 2-yl)-7-methoxy-3-met...)
Affinity DataIC50: >3.00E+4nM. Assay description: mTOR (human) was incubated with 50 mM HEPES pH 7.5, 1 mM EGTA, 0.01% Tween 20, 2 mg/ml of the substrate, 3 mM MnCl2 and [γ-33P-ATP] (specific ac...
Ligand InfoPC cidPC sid
In DepthDetails US Patent
TargetSerine-protein kinase ATM(Homo sapiens (Human))
Merck Patent
US Patent
LigandPNGBDBM418459(1-(3-Fluoro-5-methylpyridin- 2-yl)-7-methoxy-3-met...)
Affinity DataIC50: <1nM. Assay description: The IC50 value was determined with the aid of a biochemical ATM kinase assay. The assay consists of two steps: the enzymatic reaction and the detecti...
Ligand InfoPC cidPC sid
In DepthDetails US Patent
LigandPNGBDBM418459(1-(3-Fluoro-5-methylpyridin- 2-yl)-7-methoxy-3-met...)
Affinity DataIC50: >3.00E+4nM
Ligand InfoPC cidPC sid
In DepthDetails US Patent
LigandPNGBDBM418459(1-(3-Fluoro-5-methylpyridin- 2-yl)-7-methoxy-3-met...)
Affinity DataIC50: >3.00E+4nM
Ligand InfoPC cidPC sid
In DepthDetails US Patent
LigandPNGBDBM418459(1-(3-Fluoro-5-methylpyridin- 2-yl)-7-methoxy-3-met...)
Affinity DataIC50: >3.00E+4nM
Ligand InfoPC cidPC sid
In DepthDetails US Patent
LigandPNGBDBM418459(1-(3-Fluoro-5-methylpyridin- 2-yl)-7-methoxy-3-met...)
Affinity DataIC50: >3.00E+4nM
Ligand InfoPC cidPC sid
In DepthDetails US Patent
TargetSerine/threonine-protein kinase mTOR(Homo sapiens (Human))
Merck Patent
US Patent
LigandPNGBDBM418459(1-(3-Fluoro-5-methylpyridin- 2-yl)-7-methoxy-3-met...)
Affinity DataIC50: >3.00E+4nM
Ligand InfoPC cidPC sid
In DepthDetails US Patent
TargetSerine-protein kinase ATM(Homo sapiens (Human))
Merck Patent
US Patent
LigandPNGBDBM418459(1-(3-Fluoro-5-methylpyridin- 2-yl)-7-methoxy-3-met...)
Affinity DataIC50: <1nM. Assay description: The IC50 value was determined with the aid of a biochemical ATM kinase assay. The assay consists of two steps: the enzymatic reaction and the detecti...
Ligand InfoPC cidPC sid
In DepthDetails US Patent
TargetSerine-protein kinase ATM(Homo sapiens (Human))
Merck Patent
US Patent
LigandPNGBDBM418459(1-(3-Fluoro-5-methylpyridin- 2-yl)-7-methoxy-3-met...)
Affinity DataIC50: <1nM. Assay description: The IC50 value was determined with the aid of a biochemical ATM kinase assay. The assay consists of two steps: the enzymatic reaction and the detecti...
Ligand InfoPC cidPC sid
In DepthDetails US Patent
TargetSerine-protein kinase ATM(Homo sapiens (Human))
Merck Patent
US Patent
LigandPNGBDBM418459(1-(3-Fluoro-5-methylpyridin- 2-yl)-7-methoxy-3-met...)
Affinity DataIC50: <1nM. Assay description: The IC50 value was determined with the aid of a biochemical ATM kinase assay. The assay consists of two steps: the enzymatic reaction and the detecti...
Ligand InfoPC cidPC sid
In DepthDetails US Patent
LigandPNGBDBM418459(1-(3-Fluoro-5-methylpyridin- 2-yl)-7-methoxy-3-met...)
Affinity DataIC50: >3.00E+4nM. Assay description: The IC50 value was determined with the aid of a biochemical ATM kinase assay. The assay consists of two steps: the enzymatic reaction and the detecti...
Ligand InfoPC cidPC sid
In DepthDetails US Patent
LigandPNGBDBM418459(1-(3-Fluoro-5-methylpyridin- 2-yl)-7-methoxy-3-met...)
Affinity DataIC50: >3.00E+4nM. Assay description: The IC50 value was determined with the aid of a biochemical ATM kinase assay. The assay consists of two steps: the enzymatic reaction and the detecti...
Ligand InfoPC cidPC sid
In DepthDetails US Patent
LigandPNGBDBM418459(1-(3-Fluoro-5-methylpyridin- 2-yl)-7-methoxy-3-met...)
Affinity DataIC50: >3.00E+4nM. Assay description: The IC50 value was determined with the aid of a biochemical ATM kinase assay. The assay consists of two steps: the enzymatic reaction and the detecti...
Ligand InfoPC cidPC sid
In DepthDetails US Patent
LigandPNGBDBM418459(1-(3-Fluoro-5-methylpyridin- 2-yl)-7-methoxy-3-met...)
Affinity DataIC50: >3.00E+4nM. Assay description: The IC50 value was determined with the aid of a biochemical ATM kinase assay. The assay consists of two steps: the enzymatic reaction and the detecti...
Ligand InfoPC cidPC sid
In DepthDetails US Patent
TargetSerine-protein kinase ATM(Homo sapiens (Human))
Merck Patent
US Patent
LigandPNGBDBM418459(1-(3-Fluoro-5-methylpyridin- 2-yl)-7-methoxy-3-met...)
Affinity DataIC50: <1nM. Assay description: The IC50 value was determined with the aid of a biochemical ATM kinase assay. The assay consists of two steps: the enzymatic reaction and the detecti...
Ligand InfoPC cidPC sid
In DepthDetails US Patent