BDBM418849 N-methyl-N-[3-({[2-{[4-(morpholin-4- ylmethyl)phenyl]amino}-5- (trifluoromethyl)pyrimidin-4- yl]amino}methyl)pyridin-2- yl]methanesuifonamide (349)::US10450297, Example 349
SMILES CN(c1ncccc1CNc1nc(Nc2ccc(CN3CCOCC3)cc2)ncc1C(F)(F)F)S(C)(=O)=O
InChI Key InChIKey=YAIYTISZKWMAOJ-UHFFFAOYSA-N
Data  1 IC50
  Tab Delimited (TSV)   2D SDfile   Computed 3D by Vconf -m prep SDfile
Find this compound or compounds like it in BindingDB:
Activity Spreadsheet -- Enzyme Inhibition Constant Data from BindingDB
Found 1 hit for monomerid = 418849
TargetFocal adhesion kinase 1 [410-689](Homo sapiens (Human))
Pfizer
US Patent
LigandPNGBDBM418849(N-methyl-N-[3-({[2-{[4-(morpholin-4- ylmethyl)phen...)
Affinity DataIC50: <0.595nM. Assay description: The in vitro activity of the compounds of the compounds of the invention may be determined by the following procedure. More particularly, the followi...
Ligand InfoPC cidPC sid
In DepthDetails US Patent