BDBM418938 US10450301, Example 17
SMILES CC(C)n1cnnc1-c1cccc(NC(=O)c2ccc3CN(Cc3c2)C(=O)N2CCCC2)n1
InChI Key InChIKey=MFFLHJIGVFCHLJ-UHFFFAOYSA-N
Data  1 IC50
  Tab Delimited (TSV)   2D SDfile   Computed 3D by Vconf -m prep SDfile
Find this compound or compounds like it in BindingDB:
Activity Spreadsheet -- Enzyme Inhibition Constant Data from BindingDB
Found 1 hit for monomerid = 418938
TargetMitogen-activated protein kinase kinase kinase 5(Homo sapiens (Human))
Enanta Pharmaceuticals
US Patent
LigandPNGBDBM418938(US10450301, Example 17)
Affinity DataIC50:  55nM. Assay description: HTRF KinEASE-STK is a generic method for measuring serine/threonine kinase activities using a time-resolved fluorescence resonance energy transfer (T...
Ligand InfoPC cidPC sid
In DepthDetails US Patent