BDBM418963 US10450301, Example 42
SMILES CC(C)CS(=O)(=O)N1CCc2cc(F)c(cc2C1)C(=O)Nc1cccc(n1)-c1nncn1C(C)C
InChI Key InChIKey=NYBBLGKSVMGSIM-UHFFFAOYSA-N
Data  1 IC50
  Tab Delimited (TSV)   2D SDfile   Computed 3D by Vconf -m prep SDfile
Find this compound or compounds like it in BindingDB:
Activity Spreadsheet -- Enzyme Inhibition Constant Data from BindingDB
Found 1 hit for monomerid = 418963
TargetMitogen-activated protein kinase kinase kinase 5(Homo sapiens (Human))
Enanta Pharmaceuticals
US Patent
LigandPNGBDBM418963(US10450301, Example 42)
Affinity DataIC50:  5.5nM. Assay description: HTRF KinEASE-STK is a generic method for measuring serine/threonine kinase activities using a time-resolved fluorescence resonance energy transfer (T...
Ligand InfoPC cidPC sid
In DepthDetails US Patent