BDBM419005 US10450301, Example 84
SMILES C[C@H](COC(C)=O)n1nnnc1-c1cccc(NC(=O)c2cc3CN(CCc3cc2F)S(=O)(=O)CCC(F)(F)F)n1
InChI Key InChIKey=KCYUVBKMRIMYDA-CQSZACIVSA-N
Data  1 IC50
  Tab Delimited (TSV)   2D SDfile   Computed 3D by Vconf -m prep SDfile
Find this compound or compounds like it in BindingDB:
Activity Spreadsheet -- Enzyme Inhibition Constant Data from BindingDB
Found 1 hit for monomerid = 419005
TargetMitogen-activated protein kinase kinase kinase 5(Homo sapiens (Human))
Enanta Pharmaceuticals
US Patent
LigandPNGBDBM419005(US10450301, Example 84)
Affinity DataIC50: >1.00E+3nM. Assay description: HTRF KinEASE-STK is a generic method for measuring serine/threonine kinase activities using a time-resolved fluorescence resonance energy transfer (T...
Ligand InfoPC cidPC sid
In DepthDetails US Patent