BDBM419028 US10450301, Example 107
SMILES CC(C)n1nnnc1-c1cccc(NC(=O)c2cc3CN(CCc3cc2F)C(=O)N(C)CCC(F)(F)F)n1
InChI Key InChIKey=MHXGHZZYVFZWOR-UHFFFAOYSA-N
Data  1 IC50
  Tab Delimited (TSV)   2D SDfile   Computed 3D by Vconf -m prep SDfile
Find this compound or compounds like it in BindingDB:
Activity Spreadsheet -- Enzyme Inhibition Constant Data from BindingDB
Found 1 hit for monomerid = 419028
TargetMitogen-activated protein kinase kinase kinase 5(Homo sapiens (Human))
Enanta Pharmaceuticals
US Patent
LigandPNGBDBM419028(US10450301, Example 107)
Affinity DataIC50:  55nM. Assay description: HTRF KinEASE-STK is a generic method for measuring serine/threonine kinase activities using a time-resolved fluorescence resonance energy transfer (T...
Ligand InfoPC cidPC sid
In DepthDetails US Patent