BDBM419165 US10457637, Compound 33::tert-butyl 4-(4-(N-(4- ethylphenyl)-N- isobutylsulfamoyl)-2-(S- methylsulfonimidoyl)phenoxy) piperidine-1-carboxylate
SMILES CCc1ccc(cc1)N(CC(C)C)S(=O)(=O)c1ccc(OC2CCN(CC2)C(=O)OC(C)(C)C)c(c1)S(C)(=N)=O
InChI Key InChIKey=JZKSWGHTUFOAJF-UHFFFAOYSA-N
Data  1 IC50
  Tab Delimited (TSV)   2D SDfile   Computed 3D by Vconf -m prep SDfile
Find this compound or compounds like it in BindingDB:
Activity Spreadsheet -- Enzyme Inhibition Constant Data from BindingDB
Found 1 hit for monomerid = 419165
TargetNuclear receptor ROR-gamma(Homo sapiens (Human))
Galderma Research & Development
US Patent
LigandPNGBDBM419165(US10457637, Compound 33 | tert-butyl 4-(4-(N-(4- e...)
Affinity DataIC50: >1.00E+3nM. Assay description: The RORγ transactivation model was developed from the line HG5LN, which is a HeLa line that stably expresses a luciferase reporter gene controll...
Ligand InfoPC cidPC sid
In DepthDetails US Patent