BDBM419166 N-(4-ethylphenyl)-N- isobutyl-4-((3- methyloxetan-3- yl)methoxy)-3-(S- methylsulfonimidoyl)benzene- sulfonamide::US10457637, Compound 34
SMILES CCc1ccc(cc1)N(CC(C)C)S(=O)(=O)c1ccc(OCC2(C)COC2)c(c1)S(C)(=N)=O
InChI Key InChIKey=CBHYCQRWPGCYAO-UHFFFAOYSA-N
Data  1 IC50
  Tab Delimited (TSV)   2D SDfile   Computed 3D by Vconf -m prep SDfile
Find this compound or compounds like it in BindingDB:
Activity Spreadsheet -- Enzyme Inhibition Constant Data from BindingDB
Found 1 hit for monomerid = 419166
TargetNuclear receptor ROR-gamma(Homo sapiens (Human))
Galderma Research & Development
US Patent
LigandPNGBDBM419166(N-(4-ethylphenyl)-N- isobutyl-4-((3- methyloxetan-...)
Affinity DataIC50: >1.00E+3nM. Assay description: The RORγ transactivation model was developed from the line HG5LN, which is a HeLa line that stably expresses a luciferase reporter gene controll...
Ligand InfoPC cidPC sid
In DepthDetails US Patent