BDBM41919 2-[[5-(5,6-dimethyl-1H-benzimidazol-2-yl)-2-pyridinyl]thio]acetic acid ethyl ester::2-[[5-(5,6-dimethyl-1H-benzimidazol-2-yl)-2-pyridyl]thio]acetic acid ethyl ester::MLS000523462::SMR000122535::[5-(5,6-Dimethyl-1H-benzoimidazol-2-yl)-pyridin-2-ylsulfanyl]-acetic acid ethyl ester::cid_1432659::ethyl 2-[5-(5,6-dimethyl-1H-benzimidazol-2-yl)pyridin-2-yl]sulfanylacetate::ethyl 2-[5-(5,6-dimethyl-1H-benzimidazol-2-yl)pyridin-2-yl]sulfanylethanoate
SMILES CCOC(=O)CSc1ccc(cn1)-c1nc2cc(C)c(C)cc2[nH]1
InChI Key InChIKey=FXTLXNUENAQMGX-UHFFFAOYSA-N
Data  1 IC50
  Tab Delimited (TSV)   2D SDfile   Computed 3D by Vconf -m prep SDfile
Find this compound or compounds like it in BindingDB:
Activity Spreadsheet -- Enzyme Inhibition Constant Data from BindingDB
Found 1 hit for monomerid = 41919
TargetBifunctional epoxide hydrolase 2(Homo sapiens (Human))
Columbia University Molecular Screening Center
Curated by PubChem BioAssay
LigandPNGBDBM41919(2-[[5-(5,6-dimethyl-1H-benzimidazol-2-yl)-2-pyridi...)
Affinity DataIC50: >1.00E+4nM. Assay description: Data Source: Columbia University Molecular Screening Center Source (MLSCN Center Name): Columbia University Molecular Screening Center Center Affilia...
In DepthDetails PCBioAssay