BDBM419303 5-tert-Butyl-7-(3,3-difluoropyrrolidin-1-yl)-3-[[2-[2-(pyridin-2-yldisulfanyl)ethyl]phenyl]methyl]triazolo[4,5-d]pyrimidine::US10457685, Example 32
SMILES CC(C)(C)c1nc(N2CCC(F)(F)C2)c2nnn(Cc3ccccc3CCSSc3ccccn3)c2n1
InChI Key InChIKey=ZQVNQZSMSGWZJB-UHFFFAOYSA-N
Data  2 KI
  Tab Delimited (TSV)   2D SDfile   Computed 3D by Vconf -m prep SDfile
Find this compound or compounds like it in BindingDB:
Activity Spreadsheet -- Enzyme Inhibition Constant Data from BindingDB
Found 2 hits for monomerid = 419303
TargetCannabinoid receptor 2(Homo sapiens (Human))
Hoffmann-La Roche
US Patent
LigandPNGBDBM419303(5-tert-Butyl-7-(3,3-difluoropyrrolidin-1-yl)-3-[[2...)
Affinity DataKi:  72nM. Assay description: he affinity of the compounds of the invention for cannabinoid receptors was determined using recommended amounts of membrane preparations (PerkinElme...
Ligand InfoKEGGPC cidPC sid
In DepthDetails US Patent
TargetCannabinoid receptor 1(Homo sapiens (Human))
Hoffmann-La Roche
US Patent
LigandPNGBDBM419303(5-tert-Butyl-7-(3,3-difluoropyrrolidin-1-yl)-3-[[2...)
Affinity DataKi:  1.86E+3nM. Assay description: he affinity of the compounds of the invention for cannabinoid receptors was determined using recommended amounts of membrane preparations (PerkinElme...
Ligand InfoKEGGPC cidPC sid
In DepthDetails US Patent