BDBM419588 US10464911, Example 18
SMILES CC(C)N1CCN(CC1)S(=O)(=O)N(Cc1ccc(cc1F)-c1nnc(o1)C(F)F)c1ccccc1
InChI Key InChIKey=APCCFMPHZXCYBJ-UHFFFAOYSA-N
Data  1 IC50
  Tab Delimited (TSV)   2D SDfile   Computed 3D by Vconf -m prep SDfile
Find this compound or compounds like it in BindingDB:
Activity Spreadsheet -- Enzyme Inhibition Constant Data from BindingDB
Found 1 hit for monomerid = 419588
TargetHistone deacetylase 1(Homo sapiens (Human))
Chong Kun Dang Pharmaceutical
US Patent
LigandPNGBDBM419588(US10464911, Example 18)
Affinity DataIC50:  46nM. Assay description: HDAC enzyme activity was measured using a HDAC Fluorimetric Drug Discovery Kit (BML-AK511, 516, Enzo Life Science). For the HDAC1 enzyme activity tes...
Ligand InfoPC cidPC sid
In DepthDetails US Patent