BDBM419603 US10464911, Example 31
SMILES Fc1cc(ccc1CN(c1cccnc1)S(=O)(=O)N1CCNCC1)-c1nnc(o1)C(F)(F)F
InChI Key InChIKey=UVZLMQMSSNANJH-UHFFFAOYSA-N
Data  2 IC50
  Tab Delimited (TSV)   2D SDfile   Computed 3D by Vconf -m prep SDfile
Find this compound or compounds like it in BindingDB:
Activity Spreadsheet -- Enzyme Inhibition Constant Data from BindingDB
Found 2 hits for monomerid = 419603
TargetHistone deacetylase 6(Homo sapiens (Human))
Zhengzhou University
Curated by ChEMBL
LigandPNGBDBM419603(US10464911, Example 31)
Affinity DataIC50:  44nM. Assay description: Inhibition of human recombinant HDAC6 using BML-AK511 as substrate incubated for 60 mins by fluorimetric assay
Ligand InfoPC cidPC sid
In DepthDetails PubMed
TargetHistone deacetylase 1(Homo sapiens (Human))
Chong Kun Dang Pharmaceutical
US Patent
LigandPNGBDBM419603(US10464911, Example 31)
Affinity DataIC50:  44nM. Assay description: HDAC enzyme activity was measured using a HDAC Fluorimetric Drug Discovery Kit (BML-AK511, 516, Enzo Life Science). For the HDAC1 enzyme activity tes...
Ligand InfoPC cidPC sid
In DepthDetails US Patent