BDBM419644 US10464911, Example 68
SMILES C[C@@H]1CN(CCN1C)S(=O)(=O)N(Cc1ccc(cn1)-c1nnc(o1)C(F)F)c1cccc(Cl)c1
InChI Key InChIKey=JZHCKADNAOZCKV-CQSZACIVSA-N
Data  1 IC50
  Tab Delimited (TSV)   2D SDfile   Computed 3D by Vconf -m prep SDfile
Find this compound or compounds like it in BindingDB:
Activity Spreadsheet -- Enzyme Inhibition Constant Data from BindingDB
Found 1 hit for monomerid = 419644
TargetHistone deacetylase 1(Homo sapiens (Human))
Chong Kun Dang Pharmaceutical
US Patent
LigandPNGBDBM419644(US10464911, Example 68)
Affinity DataIC50:  36nM. Assay description: HDAC enzyme activity was measured using a HDAC Fluorimetric Drug Discovery Kit (BML-AK511, 516, Enzo Life Science). For the HDAC1 enzyme activity tes...
Ligand InfoPC cidPC sid
In DepthDetails US Patent