BDBM419651 US10464911, Example 74
SMILES FC(F)c1nnc(o1)-c1ccc(CN(c2cccc(Cl)c2)S(=O)(=O)N2CCN(CC2)C2CCC2)nc1
InChI Key InChIKey=FIAZVYIQRLPOGX-UHFFFAOYSA-N
Data  1 IC50
  Tab Delimited (TSV)   2D SDfile   Computed 3D by Vconf -m prep SDfile
Find this compound or compounds like it in BindingDB:
Activity Spreadsheet -- Enzyme Inhibition Constant Data from BindingDB
Found 1 hit for monomerid = 419651
TargetHistone deacetylase 1(Homo sapiens (Human))
Chong Kun Dang Pharmaceutical
US Patent
LigandPNGBDBM419651(US10464911, Example 74)
Affinity DataIC50:  36nM. Assay description: HDAC enzyme activity was measured using a HDAC Fluorimetric Drug Discovery Kit (BML-AK511, 516, Enzo Life Science). For the HDAC1 enzyme activity tes...
Ligand InfoPC cidPC sid
In DepthDetails US Patent