BDBM419658 US10464918, Compound 1-2
SMILES CO\N=C\c1ccnc(c1N)-c1ccc2ncc(-c3cc(C)cc(F)c3)c(N3CC[C@@H]4NCCO[C@H]4C3)c2c1
InChI Key InChIKey=MABXIFQNTZLBJK-QTZOKLTNSA-N
Data  1 EC50
  Tab Delimited (TSV)   2D SDfile   Computed 3D by Vconf -m prep SDfile
Find this compound or compounds like it in BindingDB:
Activity Spreadsheet -- Enzyme Inhibition Constant Data from BindingDB
Found 1 hit for monomerid = 419658
TargetSomatostatin receptor type 2(Homo sapiens (Human))
Crinetics Pharmaceuticals
US Patent
LigandPNGBDBM419658(US10464918, Compound 1-2)
Affinity DataEC50: <10nM. Assay description: Four days prior to the assay, 5,000 Chinese hamster ovary cells (CHO-K1, ATCC #CCL-61) stably expressing the human SSTR2 are plated in each well of a...
Ligand InfoPC cidPC sid
In DepthDetails US Patent