BDBM419782 US10464919, Example 120
SMILES Clc1ccc(nc1)N1CCN(Cc2ccc3c4NCCCc4c(=O)[nH]c3c2)CC1
InChI Key InChIKey=CVTFVYCHNGODLR-UHFFFAOYSA-N
Data  3 IC50
  Tab Delimited (TSV)   2D SDfile   Computed 3D by Vconf -m prep SDfile
Find this compound or compounds like it in BindingDB:
Activity Spreadsheet -- Enzyme Inhibition Constant Data from BindingDB
Found 3 hits for monomerid = 419782
TargetPoly [ADP-ribose] polymerase 1(Homo sapiens (Human))
Je Il Pharmaceutical
US Patent
LigandPNGBDBM419782(US10464919, Example 120)
Affinity DataIC50:  4.81nM. Assay description: The PARP-1 enzyme inhibitory activities of the compounds of the present invention were assayed in the following manner by use of a kit (cat. 80551) p...
Ligand InfoPC cidPC sid
In DepthDetails US Patent
TargetActivated CDC42 kinase 1(Homo sapiens (Human))
Je Il Pharmaceutical
US Patent
LigandPNGBDBM419782(US10464919, Example 120)
Affinity DataIC50:  4.82nM. Assay description: The tankyrase-1 or tankyrase-2 enzyme inhibitory activities of the compounds of the present invention were assayed in the following manner by use of ...
Ligand InfoPC cidPC sid
In DepthDetails US Patent
TargetNon-receptor tyrosine-protein kinase TNK1(Homo sapiens (Human))
Je Il Pharmaceutical
US Patent
LigandPNGBDBM419782(US10464919, Example 120)
Affinity DataIC50:  10.2nM. Assay description: The tankyrase-1 or tankyrase-2 enzyme inhibitory activities of the compounds of the present invention were assayed in the following manner by use of ...
Ligand InfoPC cidPC sid
In DepthDetails US Patent