BDBM419812 US10464919, Example 150
SMILES O=c1[nH]c2cc(CN3CCN(CC3)c3ccc4cc[nH]c4c3)ccc2c2NCCCc12
InChI Key InChIKey=WPTNASIDXWQCDG-UHFFFAOYSA-N
Data  3 IC50
  Tab Delimited (TSV)   2D SDfile   Computed 3D by Vconf -m prep SDfile
Find this compound or compounds like it in BindingDB:
Activity Spreadsheet -- Enzyme Inhibition Constant Data from BindingDB
Found 3 hits for monomerid = 419812
TargetPoly [ADP-ribose] polymerase 1(Homo sapiens (Human))
Je Il Pharmaceutical
US Patent
LigandPNGBDBM419812(US10464919, Example 150)
Affinity DataIC50:  2.49nM. Assay description: The PARP-1 enzyme inhibitory activities of the compounds of the present invention were assayed in the following manner by use of a kit (cat. 80551) p...
Ligand InfoPC cidPC sid
In DepthDetails US Patent
TargetActivated CDC42 kinase 1(Homo sapiens (Human))
Je Il Pharmaceutical
US Patent
LigandPNGBDBM419812(US10464919, Example 150)
Affinity DataIC50:  6.06nM. Assay description: The tankyrase-1 or tankyrase-2 enzyme inhibitory activities of the compounds of the present invention were assayed in the following manner by use of ...
Ligand InfoPC cidPC sid
In DepthDetails US Patent
TargetNon-receptor tyrosine-protein kinase TNK1(Homo sapiens (Human))
Je Il Pharmaceutical
US Patent
LigandPNGBDBM419812(US10464919, Example 150)
Affinity DataIC50:  18.1nM. Assay description: The tankyrase-1 or tankyrase-2 enzyme inhibitory activities of the compounds of the present invention were assayed in the following manner by use of ...
Ligand InfoPC cidPC sid
In DepthDetails US Patent