BDBM419852 US10472324, Example 3
SMILES Cc1cc(NC(=S)C(C#N)=C(O)C2CC2)ccc1[N+]([O-])=O
InChI Key InChIKey=IBSIPBVZLUJGJO-QBFSEMIESA-N
Data  1 IC50
  Tab Delimited (TSV)   2D SDfile   Computed 3D by Vconf -m prep SDfile
Find this compound or compounds like it in BindingDB:
Activity Spreadsheet -- Enzyme Inhibition Constant Data from BindingDB
Found 1 hit for monomerid = 419852
TargetGamma-aminobutyric acid receptor subunit alpha-1(Rattus norvegicus (Rat))
Algiax Pharmaceuticals
US Patent
LigandPNGBDBM419852(US10472324, Example 3)
Affinity DataIC50:  6.00E+3nM. Assay description: Standard assays were carried out to measure the effects of these compounds on the cytotoxicity, virus yield and infection rates of 2019-nCoVs. Firstl...
Ligand Info
In DepthDetails US Patent