BDBM41991 3-chloranyl-4-(dimethylamino)-1-(3-nitrophenyl)pyrrole-2,5-dione::3-chloro-4-(dimethylamino)-1-(3-nitrophenyl)-3-pyrroline-2,5-quinone::3-chloro-4-(dimethylamino)-1-(3-nitrophenyl)pyrrole-2,5-dione::MLS-0111744.0001::cid_16654771
SMILES CN(C)C1=C(Cl)C(=O)N(C1=O)c1cccc(c1)[N+]([O-])=O
InChI Key InChIKey=XYQRZBWTTOIECA-UHFFFAOYSA-N
Data  1 IC50
  Tab Delimited (TSV)   2D SDfile   Computed 3D by Vconf -m prep SDfile
Find this compound or compounds like it in BindingDB:
Activity Spreadsheet -- Enzyme Inhibition Constant Data from BindingDB
Found 1 hit for monomerid = 41991
TargetBcl-2-related protein A1(Mus musculus (Mouse))
Sanford-Burnham Center For Chemical Genomics
Curated by PubChem BioAssay
LigandPNGBDBM41991(3-chloranyl-4-(dimethylamino)-1-(3-nitrophenyl)pyr...)
Affinity DataIC50:  2.30E+3nM. Assay description: Data Source: Sanford-Burnham Center for Chemical Genomics (SBCCG) Source Affiliation: Sanford-Burnham Medical Research Institute (SBMRI, San Diego, C...
In DepthDetails PCBioAssay