BDBM419939 US10472364, Compound 24::US11208414, Cpd. # 24
SMILES COC(=O)C(OC[C@H]1O[C@H]([C@@H](F)[C@@H]1O)n1cnc2c(N)nc(Cl)nc12)P(O)(O)=O
InChI Key InChIKey=DTLDFKTUYWGWTL-VPJWIERESA-N
Data  3 IC50
  Tab Delimited (TSV)   2D SDfile   Computed 3D by Vconf -m prep SDfile
Find this compound or compounds like it in BindingDB:
Activity Spreadsheet -- Enzyme Inhibition Constant Data from BindingDB
Found 3 hits for monomerid = 419939
Target5'-nucleotidase(Homo sapiens (Human))
Calithera Biosciences
US Patent
LigandPNGBDBM419939(US10472364, Compound 24 | US11208414, Cpd. # 24)
Affinity DataIC50:  5.90E+3nM. Assay description: For measurements of soluble CD73 enzyme activity, recombinant CD73 was obtained from R&D Systems, Cat. No. 5795-EN-010. Serial dilutions of test comp...
Ligand Info
In DepthDetails US Patent
Target5'-nucleotidase(Homo sapiens (Human))
Calithera Biosciences
US Patent
LigandPNGBDBM419939(US10472364, Compound 24 | US11208414, Cpd. # 24)
Affinity DataIC50:  1.64E+4nM. Assay description: The ability of compounds to inhibit endogenous, cell-bound CD73 enzyme activity was demonstrated using SK-MEL-28 cells, which express CD73 on their s...
Ligand Info
In DepthDetails US Patent
Target5'-nucleotidase(Homo sapiens (Human))
Calithera Biosciences
US Patent
LigandPNGBDBM419939(US10472364, Compound 24 | US11208414, Cpd. # 24)
Affinity DataIC50:  5.90E+3nM. Assay description: For measurements of soluble CD73 enzyme activity, recombinant CD73 was obtained from R&D Systems, Cat. No. 5795-EN-010. Serial dilutions of test comp...
Ligand Info
In DepthDetails US Patent