BDBM420049 (S)-N-((1-isopropylpyrrolidin-2-yl)methyl)-10- methyl-1-oxo-2-phenyl-1,2-dihydropyrazino[1,2- a]indole-4-carboxamide::US10487087, Compound 14
SMILES CC(C)N1CCC[C@H]1CNC(=O)c1cn(-c2ccccc2)c(=O)c2c(C)c3ccccc3n12
InChI Key InChIKey=DYSXTIGRFLLKCH-NRFANRHFSA-N
Data  1 EC50
  Tab Delimited (TSV)   2D SDfile   Computed 3D by Vconf -m prep SDfile
Find this compound or compounds like it in BindingDB:
Activity Spreadsheet -- Enzyme Inhibition Constant Data from BindingDB
Found 1 hit for monomerid = 420049
TargetGlucagon-like peptide 1 receptor(Homo sapiens (Human))
Vanderbilt University
US Patent
LigandPNGBDBM420049((S)-N-((1-isopropylpyrrolidin-2-yl)methyl)-10- met...)
Affinity DataEC50:  1.30E+4nM. Assay description: To assess the effects of test compounds on GLP-1 or glucagon potency and efficacy, a high-throughput calcium mobilization assay was used essentially ...
Ligand Info
In DepthDetails US Patent