BDBM420081 US10487086, Example I-84
SMILES COC(=O)Nc1ccc2-c3c[nH]c(n3)[C@H](CCCC[C@@H](Nc2c1)C(O)=O)NC(=O)\C=C\c1cc(Cl)ccc1-n1cnnn1
InChI Key
Data  2 KI
  Tab Delimited (TSV)   2D SDfile   Computed 3D by Vconf -m prep SDfile
Find this compound or compounds like it in BindingDB:
Activity Spreadsheet -- Enzyme Inhibition Constant Data from BindingDB
Found 2 hits for monomerid = 420081
TargetCoagulation factor XI(Homo sapiens (Human))
Bristol-Myers Squibb
Curated by ChEMBL
LigandPNGBDBM420081(US10487086, Example I-84)
Affinity DataKi:  0.670nM. Assay description: Inhibition of recombinant human activated coagulation factor XI using pyro-Glu-Pro-Arg-pNA as substrate by spectrophotometry
Ligand Info
In DepthDetails ArticlePubMed
TargetCoagulation factor XI(Homo sapiens (Human))
Bristol-Myers Squibb
Curated by ChEMBL
LigandPNGBDBM420081(US10487086, Example I-84)
Affinity DataKi:  580nM. Assay description: The effectiveness of compounds of the present invention as inhibitors of the coagulation Factors XIa, VIIa, IXa, Xa, XIIa, plasma kallikrein or throm...
Ligand Info
In DepthDetails US Patent