BDBM420082 US10487086, Example I-94
SMILES COC(=O)Nc1ccc2-c3c[nH]c(n3)[C@H](CCCC[C@H](Nc2c1)C1=NN(C)CC1Cl)NC(=O)\C=C\c1cc(Cl)ccc1-n1cnnn1
InChI Key
Data  1 KI
  Tab Delimited (TSV)   2D SDfile   Computed 3D by Vconf -m prep SDfile
Find this compound or compounds like it in BindingDB:
Activity Spreadsheet -- Enzyme Inhibition Constant Data from BindingDB
Found 1 hit for monomerid = 420082
TargetCoagulation factor XI(Homo sapiens (Human))
Bristol-Myers Squibb
US Patent
LigandPNGBDBM420082(US10487086, Example I-94)
Affinity DataKi:  3.85E+3nM. Assay description: The effectiveness of compounds of the present invention as inhibitors of the coagulation Factors XIa, VIIa, IXa, Xa, XIIa, plasma kallikrein or throm...
Ligand Info
In DepthDetails US Patent