BDBM420121 (4-Methylpiperazin-1-yl)[(7S)-4-(pyrazolo[1,5-a]pyridin-5-ylamino)-5,6,7,8-tetrahydro[1]benzothieno[2,3-d]pyrimidin-7-yl]methanone::US10487092, Example 29
SMILES CN1CCN(CC1)C(=O)[C@H]1CCc2c(C1)sc1ncnc(Nc3ccn4nccc4c3)c21
InChI Key InChIKey=WSKSJMPGQQFVQK-HNNXBMFYSA-N
Data  1 IC50
  Tab Delimited (TSV)   2D SDfile   Computed 3D by Vconf -m prep SDfile
Find this compound or compounds like it in BindingDB:
Activity Spreadsheet -- Enzyme Inhibition Constant Data from BindingDB
Found 1 hit for monomerid = 420121
TargetIsoform 2 of MAP kinase-interacting serine/threonine-protein kinase 1 (MNK1a) 344D](Homo sapiens (Human))
Bayer Pharma Aktiengesellschaft
US Patent
LigandPNGBDBM420121((4-Methylpiperazin-1-yl)[(7S)-4-(pyrazolo[1,5-a]py...)
Affinity DataIC50:  20nM. Assay description: A recombinant fusion protein of Glutathione-S-Transferase (GST, N-terminally) and human full-length MKNK1 (amino acids 1-424 and T344D of accession n...
Ligand Info
In DepthDetails US Patent