BDBM420126 1-{[(7S)-4-(Pyrazolo[1,5-a]pyridin-5-ylamino)-5,6,7,8-tetrahydro[1]benzothieno[2,3-d]pyrimidin-7-yl]carbonyl}piperidin-4-one::US10487092, Example 33
SMILES O=C([C@H]1CCc2c(C1)sc1ncnc(Nc3ccn4nccc4c3)c21)N1CCC(=O)CC1
InChI Key InChIKey=JKGSLUOPUNBGQM-AWEZNQCLSA-N
Data  1 IC50
  Tab Delimited (TSV)   2D SDfile   Computed 3D by Vconf -m prep SDfile
Find this compound or compounds like it in BindingDB:
Activity Spreadsheet -- Enzyme Inhibition Constant Data from BindingDB
Found 1 hit for monomerid = 420126
TargetIsoform 2 of MAP kinase-interacting serine/threonine-protein kinase 1 (MNK1a) 344D](Homo sapiens (Human))
Bayer Pharma Aktiengesellschaft
US Patent
LigandPNGBDBM420126(1-{[(7S)-4-(Pyrazolo[1,5-a]pyridin-5-ylamino)-5,6,...)
Affinity DataIC50:  96nM. Assay description: A recombinant fusion protein of Glutathione-S-Transferase (GST, N-terminally) and human full-length MKNK1 (amino acids 1-424 and T344D of accession n...
Ligand Info
In DepthDetails US Patent