BDBM420293 alpha-ketoamide inhibitor 13a
SMILES CC(C)(C)OC(=O)Nc1cccn([C@@H](CC2CCCCC2)C(=O)N[C@@H](C[C@@H]2CCNC2=O)C(=O)C(=O)NC2CC2)c1=O
InChI Key InChIKey=JYNPCEUBSGNIIR-VJBMBRPKSA-N
Data  1 IC50
  Tab Delimited (TSV)   2D SDfile   Computed 3D by Vconf -m prep SDfile
Find this compound or compounds like it in BindingDB:
Activity Spreadsheet -- Enzyme Inhibition Constant Data from BindingDB
Found 1 hit for monomerid = 420293
TargetReplicase polyprotein 1ab [3264-3569](Severe acute respiratory syndrome coronavirus 2)
University Of Lubeck
LigandPNGBDBM420293(alpha-ketoamide inhibitor 13a)
Affinity DataIC50:  2.39E+3nM. Assay description: A fluorescent substrate harboring the cleavage site (indicated by the arrow, ↓) of SARS-CoV-2 Mpro(Dabcyl-KTSAVLQ↓SGFRKM-E(Edans)-NH2; GL...
Ligand Info
In DepthDetails ArticlePubMed