BDBM420322 US10479798, Compound 1
SMILES NC1Cc2c(O)cccc2OC1c1cc(F)c(F)cc1F
InChI Key InChIKey=PYCFPYLBPMMKMJ-UHFFFAOYSA-N
Data  1 IC50
  Tab Delimited (TSV)   2D SDfile   Computed 3D by Vconf -m prep SDfile
Find this compound or compounds like it in BindingDB:
Activity Spreadsheet -- Enzyme Inhibition Constant Data from BindingDB
Found 1 hit for monomerid = 420322
TargetDipeptidyl peptidase 4(Homo sapiens (Human))
East China University Of Science And Technology
US Patent
LigandPNGBDBM420322(US10479798, Compound 1)
Affinity DataIC50:  3.32E+3nM. Assay description: Screening Method:Name of method: Activity Evaluation of DPP4, Fluorescence.Instrument: Microplate reader, Envision (PerkinElmer, USA).Material: human...
Ligand Info
In DepthDetails US Patent