BDBM420412 US10479798, Compound 11
SMILES NC1Cc2c(OC1c1cc(F)c(F)cc1F)ccc1ccc(cc21)C#N
InChI Key InChIKey=SVNYWTMKYBTEHJ-UHFFFAOYSA-N
Data  1 IC50
  Tab Delimited (TSV)   2D SDfile   Computed 3D by Vconf -m prep SDfile
Find this compound or compounds like it in BindingDB:
Activity Spreadsheet -- Enzyme Inhibition Constant Data from BindingDB
Found 1 hit for monomerid = 420412
TargetDipeptidyl peptidase 4(Homo sapiens (Human))
East China University Of Science And Technology
US Patent
LigandPNGBDBM420412(US10479798, Compound 11)
Affinity DataIC50:  205nM. Assay description: Screening Method:Name of method: Activity Evaluation of DPP4, Fluorescence.Instrument: Microplate reader, Envision (PerkinElmer, USA).Material: human...
Ligand Info
In DepthDetails US Patent