BDBM420976 US10479788, Example 64::US11046688, Example 64
SMILES COc1cc(ccc1Nc1ncc2ccnc(N3CCCC3C)c2n1)-c1cnn(C)c1
InChI Key InChIKey=NLKFGIUPCNSDJF-UHFFFAOYSA-N
Data  2 IC50
  Tab Delimited (TSV)   2D SDfile   Computed 3D by Vconf -m prep SDfile
Find this compound or compounds like it in BindingDB:
Activity Spreadsheet -- Enzyme Inhibition Constant Data from BindingDB
Found 2 hits for monomerid = 420976
TargetDual specificity protein kinase TTK(Homo sapiens (Human))
Cancer Research Technology
US Patent
LigandPNGBDBM420976(US10479788, Example 64 | US11046688, Example 64)
Affinity DataIC50:  6nM. Assay description: The enzyme reaction (total volume 10 μl) was carried out in black 384-well low volume plates containing full length MPS1 (12.5 nM or 3 nM), fluo...
Ligand Info
TargetDual specificity protein kinase TTK(Homo sapiens (Human))
Cancer Research Technology
US Patent
LigandPNGBDBM420976(US10479788, Example 64 | US11046688, Example 64)
Affinity DataIC50:  6nM. Assay description: The enzyme reaction (total volume 10 μl) was carried out in black 384-well low volume plates containing full length MPS1 (12.5 nM or 3 nM), fluo...
Ligand Info
In DepthDetails US Patent